{"text_format":"1","workbook":"xlsx","n_sheets":27,"sheets":["Pengaturan Macro","MENU","INPUT","DataBase-X","DataBase-XI","DataBase-XII","Absen-X","Raport-X","Blanko-Daf Nilai X","Absen-XI","Raport-XI","Blanko-Daf Nilai XI","Absen-XII","Raport-XII","Blanko-Daf Nilai XII","Jml_X","Jml_XI","Jml_XII","Data Jml Siswa","MASUK","KELUAR","Pembinaan","Struktur Organigram","Grafik-PSB","Denah Sekolah","COVER","MOS"],"not_rendered":{"charts":2,"images":34,"macros":1,"external_links":1,"defined_names":27,"comments":0,"pivot_tables":0},"unopened":[],"bounds":{"document_bytes":16777216,"sheet_cells":100000,"rows_first":2000,"rows_last":500,"rows_between":2000,"halvings":0,"cell_chars":16384,"cell_head_chars":4096},"cells_cut":0,"cells_raw":0,"read":"whole","date_system":"1900"}

{"sheet":"Pengaturan Macro","index":0,"n_rows":38,"n_cols":1,"rows_kept":38,"cut":false,"hidden":false,"merged":[[30,0,30,6],[32,0,32,6],[34,0,34,6],[35,0,35,6],[37,0,37,6],[21,0,21,6],[22,0,22,6],[25,0,25,6],[27,0,27,6],[29,0,29,6],[12,0,12,6],[14,0,14,6],[15,0,15,6],[17,0,17,6],[18,0,18,6],[11,0,11,6],[9,0,9,6],[0,0,0,6],[1,0,1,6],[2,0,2,6],[3,0,3,6],[4,0,4,6],[8,0,8,6],[7,0,7,6]]}
["...PERINGATAN !!…"]
["Untuk menjalankan Excel Macro ini anda harus setting Macro di Office Excel anda"]
["itu artinya Macro Security dalam keadaan DISABLE"]
["Lakukan Pengaturan Macro menjadi ENABLE"]
["Tutup dokumen ini dan buka kembali untuk melihat perubahannya"]
[]
[]
["Ihsan Amrullah,SE "]
["Copyright © 2013"]
[]
[]
["PRINT CARA MENGAKTIVEKAN MACRO PADA EXCEL ANDA :"]
["Jika anda Belum Melakukan Setting Pada Microsoft Excel anda, akan  tampil pesan Security Warning, "]
[]
["pesan ini tampil karena file “file anda.xlsm” yang berarti menggandung MACRO. Macro pada file berfungsi untuk beberapa proses otomatis, sehingga macro tersebut harus dalam keadaan aktif. Untuk Melakukan Setting Macro Ikuti Langkah Berikut :"]
["1.      Click Logo Microsoft Excel di Sudut kiri atas :"]
[]
["2.      Lalu click Excel Options yang berada di bawah Sub Menu"]
["3.      Tampil jendela Option pilih  Popular lalu pilih bullet ke 3  show Developer ribbon"]
[]
["Lalu clik OK"]
["4.      Sekarang Menu Developer telah tampil pada Toolbar teratas Excel anda"]
["5.      Pilih Trust Center pada excel option"]
[]
[]
["Lalu pilih Trust center setting"]
[]
["6.      Pada Jendela Trust center pilih  Macro Setting"]
[]
["Centang Bullet ke 4 ( Enable All Macros [Not recommended…….]) Lalu click OK"]
["7.      Sekarang buka file excel macro anda, pada  Microsoft Excel anda tampil ribbon baru “Developer."]
[]
["8.      Sekarang buka file excel macro anda, pada  Microsoft Excel anda tampil “Security Warning”."]
[]
["9.      Click “Option” sehingga tampil jendela peringatan"]
["10.  Pilih Enable , akan tampil warning lagi lalu pilih “Continue”"]
[]
["11.  Sekarang lanjutkan pekerjaan anda, setting ini hanya sekali dilakukan dalam computer anda, selanjutnya anda tidak perlu setting kembali untuk membuka file macro anda."]

{"sheet":"MENU","index":1,"n_rows":19,"n_cols":7,"rows_kept":19,"cut":false,"hidden":false,"merged":[[2,2,3,5],[2,6,2,7],[3,6,3,7],[8,2,9,2],[14,2,14,3],[10,2,11,2],[4,4,10,7],[11,4,12,7],[15,2,16,3],[17,2,18,5],[18,6,18,7],[17,6,17,7],[15,4,15,5],[15,6,15,7],[16,4,16,5],[16,6,16,7]]}
[]
[]
[null,null,"PROGRAM DATABASE SISWA BASIS MACRO EXCEL 2007",null,null,null,"PEMERINTAH"]
[null,null,null,null,null,null,"KOTA CILEGON"]
[null,null,"SEMESTER","annisa"," SELAMAT DATANG DI APLIKASI DATABASE SMA DENGAN PROGRAM MACRO SEBELUM MELANJUTKAN PEKERJAAN PASTIKAN SETTING MACRO EXCEL ANDA AKTIF UNTUK MENGAKTIFKANNNYA BACA PETUNJUK SETTING MACRO CLIK PENGATURAN MACRO"]
[null,null,"TAHUN KEGIATAN",2013]
[null,null,"TAHUN AJARAN","2013-2014"]
[null,null,"NAMA SEKOLAH","SMA NEGERI 5 CILEGON"]
[null,null,"KEPALA SEKOLAH","Asep Mansur, M.Pd"]
[null,null,null,"NIP. 19620101 198512 1 004"]
[null,null,"WAKA KURIKULUM","Nur Badriyah,S.Pd"]
[null,null,null,"NIP: 19740217 200604 2 002","PENGATURAN MACRO"]
[null,null,"Kota / Kabupaten","Cilegon"]
[null,null,"Alamat  ","Jl.Sunan Bonang Kel. Banjarnegara Ciwandan Cilegon 42444"]
[null,null,"PILIH SEMESTER YANG AKAN DI INPUT"]
[null,null,null,null,"Alamat Website Sekolah",null,"www.sma5.yolasite.com"]
[null,null,null,null,"Alamat e-mail Sekolah",null,"tusman5clg@gmail.com & sman5_clg@yahoo.co.id"]
[null,null,"ISI SEMUA KOLOM PUTIH/LETTER BIRU JIKA SUDAH SELESAI CLICK TOMBOL KEMBALI KE MENU",null,null,null,"Diskusi IT Kunjungi ?"]
[null,null,null,null,null,null,"www.ichanov.wordpress.com"]

{"sheet":"INPUT","index":2,"n_rows":71,"n_cols":15,"rows_kept":71,"cut":false,"hidden":false,"merged":[[1,11,1,14],[3,11,3,12],[5,11,10,11],[5,1,10,1],[3,1,3,2],[1,1,1,4],[1,6,1,9],[3,6,3,7],[5,6,10,6]]}
[]
[null,"INPUT DATA KELAS DAN WALI KELAS",null,null,null,null,"INPUT DATA KELAS DAN WALI KELAS",null,null,null,null,"INPUT DATA KELAS DAN WALI KELAS"]
[]
[null,"NAMA KELAS",null,"NAMA WALI KELAS","JABATAN ",null,"NAMA KELAS",null,"NAMA WALI KELAS","JABATAN ",null,"NAMA KELAS",null,"NAMA WALI KELAS","JABATAN "]
[]
[null,"X","X-1","Annisa Diyah  Waryuni,M.Pd","Guru Madya Tk I",null,"XI","XI IPA-1","Nismawati,S.Si","Penata Muda",null,"XII","XII IPA-1","Dian Misdiyana,S.Pd","Guru Madya"]
[null,null,"X-2","Tina Martiana,S.Pd","Penata Muda",null,null,"XI IPA-2","Sati fatchani,S.Pd","Penata Muda",null,null,"XII IPA-2","Ria Setiya Wardani,S.Pd","Guru Madya Tk I"]
[null,null,"X-3","Apriyani Dewi Mayasari,M.Pd","Penata Muda",null,null,"XI IPA-3","Ragil Widyaningsih,S.Pd","Penata Muda",null,null,"XII IPA-3","Farida  Kustyarini,S.Si","Guru Madya Tk I"]
[null,null,"X-4","Rochma,S.Pd","Guru Madya Tk I",null,null,"XI IPS-1","Dian Lestari,S.PD","Penata Muda",null,null,"XII IPS-1","Nanik Tri Handayani,S.Pd","Guru Madya"]
[null,null,"X-5","Rukyati,S.Pd","Guru Madya Tk I",null,null,"XI IPS-2","Arie Septiningrum,S.Pd","Penata Muda",null,null,"XII IPS-2","Nurulhijjah,S.PD","Guru Pembina"]
[null,null,"X-6","Tati Susilawati,SE","Penata Muda",null,null,"XI IPS-3","Toyyibah,M.Pd","Guru Madya",null,null,"XII IPS-3","Erning Pangesti,S.Sos","Guru Madya Tk I"]
[]
[]
[null,null,null,"DATA SEKOLAH PENDAFTAR",null,null,null,null,null,null,null,null,null,"DATA PEKERJAAN ORANG TUA"]
[]
[null,null,null,"SMPN 1 CILEGON",null,null,null,null,null,null,null,null,null,"BURUH HARIAN"]
[null,null,null,"SMPN 2 CILEGON",null,null,null,null,null,null,null,null,null,"PEG / KARY. SWASTA"]
[null,null,null,"SMPN 3 CILEGON",null,null,null,null,null,null,null,null,null,"PNS"]
[null,null,null,"SMPN 4 CILEGON",null,null,null,null,null,null,null,null,null,"WIRASWASTA"]
[null,null,null,"SMPN 5 CILEGON",null,null,null,null,null,null,null,null,null,"KARY/ PEGAWAI .BUMN"]
[null,null,null,"SMPN 6 CILEGON",null,null,null,null,null,null,null,null,null,"KEPOLISIAN"]
[null,null,null,"SMPN 7 CILEGON",null,null,null,null,null,null,null,null,null,"PENSIUNAN"]
[null,null,null,"SMPN 8 CILEGON",null,null,null,null,null,null,null,null,null,"HONORER"]
[null,null,null,"SMPN 9 CILEGON",null,null,null,null,null,null,null,null,null,"GURU"]
[null,null,null,"SMPN 10 CILEGON",null,null,null,null,null,null,null,null,null,"PETANI"]
[null,null,null,"SMPN 11 CILEGON",null,null,null,null,null,null,null,null,null,"NELAYAN"]
[null,null,null,"SMP MADINATUL HADIED",null,null,null,null,null,null,null,null,null,"PEDAGANG"]
[null,null,null,"SMP MUHAMMADIYAH CILEGON"]
[null,null,null,"SMP PGRI 2 CILEGON"]
[null,null,null,"SMP AL-ISHLAH"]
[null,null,null,"SMP YP FATAHILAH"]
[null,null,null,"SMP YP 17 CILEGON",null,null,null,null,null,null,null,null,null,"LAINNYA"]
[null,null,null,"SMP MAFLAHUL UMMAH"]
[null,null,null,"SMP TUNAS BANGSA CILEGON"]
[null,null,null,"SMPIT R-JANNAH"]
[null,null,null,"SMP YPWKS"]
[null,null,null,"MTSN CILEGON"]
[null,null,null,"MTSN CIWANDAN"]
[null,null,null,"MTS ALKH-KRACAK"]
[null,null,null,"MTS AL-ITMAM"]
[null,null,null,"MTS AL-INAYAH"]
[null,null,null,"MTS AL-KHAIRIYAH DELINSENG"]
[null,null,null,"MTS AL-KHAIRIYAH PEKALONGAN"]
[null,null,null,"MTS AL-KHAIRIYAH KUBANGSARI"]
[null,null,null,"MTS AL-KHAIRIYAH PENAUHAN"]
[null,null,null,"MTS AL-BUSTANIYAH"]
[null,null,null,"MTS AL-IANAH JANGKAR"]
[null,null,null,"MTS AL-KH-KARANG JETAK"]
[null,null,null,"MTS YP HIKMATUL ULUM"]
[null,null,null,"MTS AL-KHAIRIYAH CITANGKIL"]
[null,null,null,"MTS AL-MUMTAZ MERAK"]
[null,null,null,"MTS BANINAWAWY"]
[null,null,null,"MTS AL-HIDAYAH"]
[null,null,null,"MTS AL-KH TGL BUNTU"]
[null,null,null,"MTS ARDANIAH SERANG"]
[null,null,null,"SMPN 1 MANCAK"]
[null,null,null,"SMPN 2 MANCAK"]
[null,null,null,"SMPN 1 KRAMATWATU"]
[null,null,null,"SMPN 1 ANYAR"]
[null,null,null,"SMPN 3 MANCAK"]
[null,null,null,"SMPN 3 KRAMATWATU"]
[null,null,null,"SMPIT DARUSSALAM PIPITAN"]
[null,null,null,"SMPN 1 ATAP 2 TUNGKAL ULU"]
[null,null,null,"SMPN 3 TANGERANG"]
[null,null,null,"MTsN ANYAR"]
[null,null,null,"MTS DAAR EL QOLAM"]
[null,null,null,"SMPN METRO"]
[null,null,null,"SMP 15 B.LAMPUNG"]
[null,null,null,"MTSN CILEGON"]
[null,null,null,"MTSN CIWANDAN"]
[null,null,null,"LAINNYA"]

{"sheet":"DataBase-X","index":3,"n_rows":440,"n_cols":35,"rows_kept":440,"cut":false,"hidden":false,"merged":[[0,8,0,9],[0,31,0,33],[346,0,346,22],[347,0,347,22],[348,21,349,21],[439,12,440,12],[352,21,353,21],[354,21,355,21],[0,26,0,29],[0,30,1,30],[350,21,351,21]]}
["NO","KELAS","NAMA","NIS","NISN","L/P","TMPT LHR","TGL LAHIR","Val",null,"Usia ","NAMA ORANG TUA","PENDAPATAN ORANG TUA","PEKERJAAN ORANG TUA ( AYAH )","ALAMAT","NO STTB","NO SKHU","NO PESERTA UJIAN SMP","ASAL SEKOLAH","THN LULUS","SMP/ MTs","NO TELP/HP",null,"NAMA IBU","WALI KELAS","JABATAN","NEM UN",null,null,null,"TOTAL NILAI","DATA SISWA MUTASI"]
[1,2,3,4,5,6,7,8,9,10,11,12,13,14,15,16,17,18,19,20,21,22,23,24,25,26,"B.Ind","B.Ing","Mate","IPA",null,"Tanggal Bulan dan Tahun","Kelas dan Semester yang ditinggalkan","Alasan Keluar dan atas permintaan (Tertulis)",33]
["Contoh>>","X-1","AAM TAMIMI",12130001,"9970454991","L","CILEGON","1997-05-04",1997,{"$f":"+MENU!$D$6","v":2013},{"$f":"+J3-I3","v":16},"AHYADI","Rp 500 - 700 Ribu","BURUH HARIAN","Jl.Sunan Drajat Link.Cirahap RT 17/02 Ciwandan Cilegon 42444","DN-30 DI 0028823","DN-30 DI 2803800","2-12-30-03-005-139-6","SMPN 4 CILEGON",2012,"SMP","087773100391","Islam",null,null,null,null,null,null,null,null,"31/01/2012","X-1 Semester 1","Permintaan Orang Tua "]
["No Urut","PILIH Kls",null,null,null,null,null,null,null,null,null,null,null,null,null,null,null,null,null,null,null,null,null,null,null,null,null,null,null,null,null,"2013-01-23","XI-IPA 1 Semester 1","Permintaan Orang Tua "]
[1,{"$f":"+INPUT!$C$6","v":"X-1"},"ALVIRA",13140016,9970456061,"P","CILEGON","1998-10-04",{"$f":"TODAY()","v":"2013-07-24"},{"$f":"+$J$3","v":2013},{"$f":"IF(H5=\"\",\"\",DATEDIF(H5,I5,\"y\"))","v":14},null,null,null,null,null,null,null,null,null,null,null,null,null,null,null,null,null,null,null,{"$f":"AVERAGE(AA5:AD5)","v":{"$error":"#DIV/0!"}},null,null,null,{"$f":"+B5","v":"X-1"}]
[2,{"$f":"IF(A6=0,\" \",+B5)","v":"X-1"},null,null,null,null,null,null,{"$f":"TODAY()","v":"2013-07-24"},2013,{"$f":"IF(H6=\"\",\"\",DATEDIF(H6,I6,\"y\"))","v":""},null,null,null,null,null,null,null,null,null,null,null,null,null,null,null,null,null,null,null,{"$error":"#DIV/0!"}]
[3,{"$f":"IF(A7=0,\" \",+B6)","v":"X-1"},null,null,null,null,null,null,"2013-07-24",2013,"",null,null,null,null,null,null,null,null,null,null,null,null,null,null,null,null,null,null,null,{"$error":"#DIV/0!"}]
[4,"X-1",null,null,null,null,null,null,"2013-07-24",2013,"",null,null,null,null,null,null,null,null,null,null,null,null,null,null,null,null,null,null,null,{"$error":"#DIV/0!"}]
[5,"X-1",null,null,null,null,null,null,"2013-07-24",2013,"",null,null,null,null,null,null,null,null,null,null,null,null,null,null,null,null,null,null,null,{"$error":"#DIV/0!"}]
[6,"X-1",null,null,null,null,null,null,"2013-07-24",2013,"",null,null,null,null,null,null,null,null,null,null,null,null,null,null,null,null,null,null,null,{"$error":"#DIV/0!"}]
[7,"X-1",null,null,null,null,null,null,"2013-07-24",2013,"",null,null,null,null,null,null,null,null,null,null,null,null,null,null,null,null,null,null,null,{"$error":"#DIV/0!"}]
[8,"X-1",null,null,null,null,null,null,"2013-07-24",2013,"",null,null,null,null,null,null,null,null,null,null,null,null,null,null,null,null,null,null,null,{"$error":"#DIV/0!"}]
[9,"X-1",null,null,null,null,null,null,"2013-07-24",2013,"",null,null,null,null,null,null,null,null,null,null,null,null,null,null,null,null,null,null,null,{"$error":"#DIV/0!"}]
[10,"X-1",null,null,null,null,null,null,"2013-07-24",2013,"",null,null,null,null,null,null,null,null,null,null,null,null,null,null,null,null,null,null,null,{"$error":"#DIV/0!"}]
[11,"X-1",null,null,null,null,null,null,"2013-07-24",2013,"",null,null,null,null,null,null,null,null,null,null,null,null,null,null,null,null,null,null,null,{"$error":"#DIV/0!"}]
[12,"X-1",null,null,null,null,null,null,"2013-07-24",2013,"",null,null,null,null,null,null,null,null,null,null,null,null,null,null,null,null,null,null,null,{"$error":"#DIV/0!"}]
[13,"X-1",null,null,null,null,null,null,"2013-07-24",2013,"",null,null,null,null,null,null,null,null,null,null,null,null,null,null,null,null,null,null,null,{"$error":"#DIV/0!"}]
[14,"X-1",null,null,null,null,null,null,"2013-07-24",2013,"",null,null,null,null,null,null,null,null,null,null,null,null,null,null,null,null,null,null,null,{"$error":"#DIV/0!"}]
[15,"X-1",null,null,null,null,null,null,"2013-07-24",2013,"",null,null,null,null,null,null,null,null,null,null,null,null,null,null,null,null,null,null,null,{"$error":"#DIV/0!"}]
[16,"X-1",null,null,null,null,null,null,"2013-07-24",2013,"",null,null,null,null,null,null,null,null,null,null,null,null,null,null,null,null,null,null,null,{"$error":"#DIV/0!"}]
[17,"X-1",null,null,null,null,null,null,"2013-07-24",2013,"",null,null,null,null,null,null,null,null,null,null,null,null,null,null,null,null,null,null,null,{"$error":"#DIV/0!"}]
[18,"X-1",null,null,null,null,null,null,"2013-07-24",2013,"",null,null,null,null,null,null,null,null,null,null,null,null,null,null,null,null,null,null,null,{"$error":"#DIV/0!"}]
[19,"X-1",null,null,null,null,null,null,"2013-07-24",2013,"",null,null,null,null,null,null,null,null,null,null,null,null,null,null,null,null,null,null,null,{"$error":"#DIV/0!"}]
[20,"X-1",null,null,null,null,null,null,"2013-07-24",2013,"",null,null,null,null,null,null,null,null,null,null,null,null,null,null,null,null,null,null,null,{"$error":"#DIV/0!"}]
[21,"X-1",null,null,null,null,null,null,"2013-07-24",2013,"",null,null,null,null,null,null,null,null,null,null,null,null,null,null,null,null,null,null,null,{"$error":"#DIV/0!"}]
[22,"X-1",null,null,null,null,null,null,"2013-07-24",2013,"",null,null,null,null,null,null,null,null,null,null,null,null,null,null,null,null,null,null,null,{"$error":"#DIV/0!"}]
[23,"X-1",null,null,null,null,null,null,"2013-07-24",2013,"",null,null,null,null,null,null,null,null,null,null,null,null,null,null,null,null,null,null,null,{"$error":"#DIV/0!"}]
[24,"X-1",null,null,null,null,null,null,"2013-07-24",2013,"",null,null,null,null,null,null,null,null,null,null,null,null,null,null,null,null,null,null,null,{"$error":"#DIV/0!"}]
[25,"X-1",null,null,null,null,null,null,"2013-07-24",2013,"",null,null,null,null,null,null,null,null,null,null,null,null,null,null,null,null,null,null,null,{"$error":"#DIV/0!"}]
[26,"X-1",null,null,null,null,null,null,"2013-07-24",2013,"",null,null,null,null,null,null,null,null,null,null,null,null,null,null,null,null,null,null,null,{"$error":"#DIV/0!"}]
[27,"X-1",null,null,null,null,null,null,"2013-07-24",2013,"",null,null,null,null,null,null,null,null,null,null,null,null,null,null,null,null,null,null,null,{"$error":"#DIV/0!"}]
[28,"X-1",null,null,null,null,null,null,"2013-07-24",2013,"",null,null,null,null,null,null,null,null,null,null,null,null,null,null,null,null,null,null,null,{"$error":"#DIV/0!"}]
[29,"X-1",null,null,null,null,null,null,"2013-07-24",2013,"",null,null,null,null,null,null,null,null,null,null,null,null,null,null,null,null,null,null,null,{"$error":"#DIV/0!"}]
[30,"X-1",null,null,null,null,null,null,"2013-07-24",2013,"",null,null,null,null,null,null,null,null,null,null,null,null,null,null,null,null,null,null,null,{"$error":"#DIV/0!"}]
[31,"X-1",null,null,null,null,null,null,"2013-07-24",2013,"",null,null,null,null,null,null,null,null,null,null,null,null,null,null,null,null,null,null,null,{"$error":"#DIV/0!"}]
[32,"X-1",null,null,null,null,null,null,"2013-07-24",2013,"",null,null,null,null,null,null,null,null,null,null,null,null,null,null,null,null,null,null,null,{"$error":"#DIV/0!"}]
[33,"X-1",null,null,null,null,null,null,"2013-07-24",2013,"",null,null,null,null,null,null,null,null,null,null,null,null,null,null,null,null,null,null,null,{"$error":"#DIV/0!"}]
[34,"X-1",null,null,null,null,null,null,"2013-07-24",2013,"",null,null,null,null,null,null,null,null,null,null,null,null,null,null,null,null,null,null,null,{"$error":"#DIV/0!"}]
[35,"X-1",null,null,null,null,null,null,"2013-07-24",2013,"",null,null,null,null,null,null,null,null,null,null,null,null,null,null,null,null,null,null,null,{"$error":"#DIV/0!"}]
[36,"X-1",null,null,null,null,null,null,"2013-07-24",2013,"",null,null,null,null,null,null,null,null,null,null,null,null,null,null,null,null,null,null,null,{"$error":"#DIV/0!"}]
[37,"X-1",null,null,null,null,null,null,"2013-07-24",2013,"",null,null,null,null,null,null,null,null,null,null,null,null,null,null,null,null,null,null,null,{"$error":"#DIV/0!"}]
[38,"X-1",null,null,null,null,null,null,{"$f":"TODAY()","v":"2013-07-24"},2013,""]
[39,"X-1",null,null,null,null,null,null,"2013-07-24",2013,""]
[40,"X-1",null,null,null,null,null,null,"2013-07-24",2013,""]
[41,"X-1",null,null,null,null,null,null,"2013-07-24",2013,""]
[42,"X-1",null,null,null,null,null,null,"2013-07-24",2013,"",null,null,null,null,null,null,null,null,null,null,null,null,null,{"$f":"+INPUT!$D$6","v":"Annisa Diyah  Waryuni,M.Pd"},{"$f":"+INPUT!$E$6","v":"Guru Madya Tk I"}]
[43,"X-1",null,null,null,null,null,null,"2013-07-24",2013,"",null,null,null,null,null,null,null,null,null,null,null,null,null,{"$f":"+INPUT!$D$6","v":"Annisa Diyah  Waryuni,M.Pd"},{"$f":"+INPUT!$E$6","v":"Guru Madya Tk I"}]
[44,"X-1",null,null,null,null,null,null,"2013-07-24",2013,"",null,null,null,null,null,null,null,null,null,null,null,null,null,{"$f":"+INPUT!$D$6","v":"Annisa Diyah  Waryuni,M.Pd"},{"$f":"+INPUT!$E$6","v":"Guru Madya Tk I"}]
[45,"X-1",null,null,null,null,null,null,"2013-07-24",2013,"",null,null,null,null,null,null,null,null,null,null,null,null,null,{"$f":"+INPUT!$D$6","v":"Annisa Diyah  Waryuni,M.Pd"},{"$f":"+INPUT!$E$6","v":"Guru Madya Tk I"}]
[null,null,null,null,null,{"$f":"COUNTIF(F5:F49,\"L\")","v":0},"Laki-laki",14,"14 Th",{"$f":"+K50/$F$52*100%","v":1},{"$f":"COUNTIF(K5:K49,\"14\")","v":1},null,"BURUH HARIAN",0,null,null,null,null,null,"SMP",{"$f":"COUNTIF(U5:U49,\"SMP\")","v":0},"Islam",{"$f":"COUNTIF(W5:W49,\"Islam\")","v":0}]
[null,null,null,null,null,{"$f":"COUNTIF(F5:F49,\"P\")","v":1},"Perempuan",15,"15 Th",0,{"$f":"COUNTIF(K5:K49,\"15\")","v":0},null,"PEG / KARY. SWASTA",0,null,null,null,null,null,"MTs",{"$f":"COUNTIF(U5:U49,\"MTs\")","v":0},"Katolik",{"$f":"COUNTIF(W5:W49,\"Katolik\")","v":0}]
[null,null,null,null,null,{"$f":"+F50+F51","v":1},"Total Siswa",16,"16 Th",0,{"$f":"COUNTIF(K5:K49,\"16\")","v":0},null,"PNS",0,null,null,null,null,null,"Lainnya",{"$f":"+U50+U51","v":0},"Protestan",{"$f":"COUNTIF(W5:W49,\"Protestan\")","v":0}]
[null,null,null,null,null,null,null,17,"17 Th",0,{"$f":"COUNTIF(K5:K49,\"17\")","v":0},null,"WIRASWASTA",0,null,null,null,null,null,null,null,"Hindu",{"$f":"COUNTIF(W5:W49,\"Hindu\")","v":0}]
[null,null,null,null,null,null,null,18,"18 Th",0,{"$f":"COUNTIF(K5:K49,\"18\")","v":0},null,"KARY/ PEGAWAI .BUMN",0,null,null,null,null,null,null,null,"Budha",{"$f":"COUNTIF(W5:W49,\"Budha\")","v":0}]
[null,null,null,null,null,null,null,13,"19 Th",0,{"$f":"COUNTIF(K5:K49,\"13\")","v":0},null,"KEPOLISIAN",0,null,null,null,null,null,null,null,null,{"$f":"SUM(W50:W54)","v":0}]
[null,null,null,null,null,null,null,null,"20 Th",0,null,null,"PENSIUNAN",0]
[null,null,null,null,null,null,null,null,"TOTAL",{"$f":"+K57/$F$52*100%","v":1},{"$f":"SUM(K50:K56)","v":1},null,"HONORER",0]
[null,null,null,null,null,null,null,null,null,null,null,null,"GURU",0]
[null,null,null,null,null,null,null,null,null,null,null,null,"TAK ADA DATA",0]
[null,null,null,null,null,null,null,null,null,null,null,null,"TOTAL DATA",0]
[null,{"$f":"MAX(A5:A49)","v":45}]
[{"$f":"+$B$61+1","v":46},{"$f":"+INPUT!$C$7","v":"X-2"},"ADITYA YUDISTIRA",13140071,9980450357,"L","SERANG","1998-03-25",{"$f":"TODAY()","v":"2013-07-24"},{"$f":"+$J$3","v":2013},{"$f":"IF(H62=\"\",\"\",DATEDIF(H62,I62,\"y\"))","v":15},null,null,null,null,null,null,null,null,null,null,null,null,null,null,null,null,null,null,null,{"$f":"AVERAGE(AA62:AD62)","v":{"$error":"#DIV/0!"}},null,null,null,{"$f":"+B62","v":"X-2"}]
[{"$f":"+A62+1","v":47},{"$f":"IF(A63=0,\" \",+B62)","v":"X-2"},null,null,null,null,null,null,{"$f":"TODAY()","v":"2013-07-24"},2013,{"$f":"IF(H63=\"\",\"\",DATEDIF(H63,I63,\"y\"))","v":""},null,null,null,null,null,null,null,null,null,null,null,null,null,null,null,null,null,null,null,{"$error":"#DIV/0!"}]
[{"$f":"+A63+1","v":48},{"$f":"IF(A64=0,\" \",+B63)","v":"X-2"},null,null,null,null,null,null,"2013-07-24",2013,"",null,null,null,null,null,null,null,null,null,null,null,null,null,null,null,null,null,null,null,{"$error":"#DIV/0!"}]
[49,{"$f":"IF(A65=0,\" \",+B64)","v":"X-2"},null,null,null,null,null,null,"2013-07-24",2013,"",null,null,null,null,null,null,null,null,null,null,null,null,null,null,null,null,null,null,null,{"$error":"#DIV/0!"}]
[50,"X-2",null,null,null,null,null,null,"2013-07-24",2013,"",null,null,null,null,null,null,null,null,null,null,null,null,null,null,null,null,null,null,null,{"$error":"#DIV/0!"}]
[51,"X-2",null,null,null,null,null,null,"2013-07-24",2013,"",null,null,null,null,null,null,null,null,null,null,null,null,null,null,null,null,null,null,null,{"$error":"#DIV/0!"}]
[52,"X-2",null,null,null,null,null,null,"2013-07-24",2013,"",null,null,null,null,null,null,null,null,null,null,null,null,null,null,null,null,null,null,null,{"$error":"#DIV/0!"}]
[53,"X-2",null,null,null,null,null,null,"2013-07-24",2013,"",null,null,null,null,null,null,null,null,null,null,null,null,null,null,null,null,null,null,null,{"$error":"#DIV/0!"}]
[54,"X-2",null,null,null,null,null,null,"2013-07-24",2013,"",null,null,null,null,null,null,null,null,null,null,null,null,null,null,null,null,null,null,null,{"$error":"#DIV/0!"}]
[55,"X-2",null,null,null,null,null,null,"2013-07-24",2013,"",null,null,null,null,null,null,null,null,null,null,null,null,null,null,null,null,null,null,null,{"$error":"#DIV/0!"}]
[56,"X-2",null,null,null,null,null,null,"2013-07-24",2013,"",null,null,null,null,null,null,null,null,null,null,null,null,null,null,null,null,null,null,null,{"$error":"#DIV/0!"}]
[57,"X-2",null,null,null,null,null,null,"2013-07-24",2013,"",null,null,null,null,null,null,null,null,null,null,null,null,null,null,null,null,null,null,null,{"$error":"#DIV/0!"}]
[58,"X-2",null,null,null,null,null,null,"2013-07-24",2013,"",null,null,null,null,null,null,null,null,null,null,null,null,null,null,null,null,null,null,null,{"$error":"#DIV/0!"}]
[59,"X-2",null,null,null,null,null,null,"2013-07-24",2013,"",null,null,null,null,null,null,null,null,null,null,null,null,null,null,null,null,null,null,null,{"$error":"#DIV/0!"}]
[60,"X-2",null,null,null,null,null,null,"2013-07-24",2013,"",null,null,null,null,null,null,null,null,null,null,null,null,null,null,null,null,null,null,null,{"$error":"#DIV/0!"}]
[61,"X-2",null,null,null,null,null,null,"2013-07-24",2013,"",null,null,null,null,null,null,null,null,null,null,null,null,null,null,null,null,null,null,null,{"$error":"#DIV/0!"}]
[62,"X-2",null,null,null,null,null,null,"2013-07-24",2013,"",null,null,null,null,null,null,null,null,null,null,null,null,null,null,null,null,null,null,null,{"$error":"#DIV/0!"}]
[63,"X-2",null,null,null,null,null,null,"2013-07-24",2013,"",null,null,null,null,null,null,null,null,null,null,null,null,null,null,null,null,null,null,null,{"$error":"#DIV/0!"}]
[64,"X-2",null,null,null,null,null,null,"2013-07-24",2013,"",null,null,null,null,null,null,null,null,null,null,null,null,null,null,null,null,null,null,null,{"$error":"#DIV/0!"}]
[65,"X-2",null,null,null,null,null,null,"2013-07-24",2013,"",null,null,null,null,null,null,null,null,null,null,null,null,null,null,null,null,null,null,null,{"$error":"#DIV/0!"}]
[66,"X-2",null,null,null,null,null,null,"2013-07-24",2013,"",null,null,null,null,null,null,null,null,null,null,null,null,null,null,null,null,null,null,null,{"$error":"#DIV/0!"}]
[67,"X-2",null,null,null,null,null,null,"2013-07-24",2013,"",null,null,null,null,null,null,null,null,null,null,null,null,null,null,null,null,null,null,null,{"$error":"#DIV/0!"}]
[68,"X-2",null,null,null,null,null,null,"2013-07-24",2013,"",null,null,null,null,null,null,null,null,null,null,null,null,null,null,null,null,null,null,null,{"$error":"#DIV/0!"}]
[69,"X-2",null,null,null,null,null,null,"2013-07-24",2013,"",null,null,null,null,null,null,null,null,null,null,null,null,null,null,null,null,null,null,null,{"$error":"#DIV/0!"}]
[70,"X-2",null,null,null,null,null,null,"2013-07-24",2013,"",null,null,null,null,null,null,null,null,null,null,null,null,null,null,null,null,null,null,null,{"$error":"#DIV/0!"}]
[71,"X-2",null,null,null,null,null,null,"2013-07-24",2013,"",null,null,null,null,null,null,null,null,null,null,null,null,null,null,null,null,null,null,null,{"$error":"#DIV/0!"}]
[72,"X-2",null,null,null,null,null,null,"2013-07-24",2013,"",null,null,null,null,null,null,null,null,null,null,null,null,null,null,null,null,null,null,null,{"$error":"#DIV/0!"}]
[73,"X-2",null,null,null,null,null,null,"2013-07-24",2013,"",null,null,null,null,null,null,null,null,null,null,null,null,null,null,null,null,null,null,null,{"$error":"#DIV/0!"}]
[74,"X-2",null,null,null,null,null,null,"2013-07-24",2013,"",null,null,null,null,null,null,null,null,null,null,null,null,null,null,null,null,null,null,null,{"$error":"#DIV/0!"}]
[75,"X-2",null,null,null,null,null,null,"2013-07-24",2013,"",null,null,null,null,null,null,null,null,null,null,null,null,null,null,null,null,null,null,null,{"$error":"#DIV/0!"}]
[76,"X-2",null,null,null,null,null,null,"2013-07-24",2013,"",null,null,null,null,null,null,null,null,null,null,null,null,null,null,null,null,null,null,null,{"$error":"#DIV/0!"}]
[77,"X-2",null,null,null,null,null,null,"2013-07-24",2013,"",null,null,null,null,null,null,null,null,null,null,null,null,null,null,null,null,null,null,null,{"$error":"#DIV/0!"}]
[78,"X-2",null,null,null,null,null,null,"2013-07-24",2013,"",null,null,null,null,null,null,null,null,null,null,null,null,null,null,null,null,null,null,null,{"$error":"#DIV/0!"}]
[79,"X-2",null,null,null,null,null,null,"2013-07-24",2013,"",null,null,null,null,null,null,null,null,null,null,null,null,null,null,null,null,null,null,null,{"$error":"#DIV/0!"}]
[80,"X-2",null,null,null,null,null,null,"2013-07-24",2013,"",null,null,null,null,null,null,null,null,null,null,null,null,null,null,null,null,null,null,null,{"$error":"#DIV/0!"}]
[81,"X-2",null,null,null,null,null,null,"2013-07-24",2013,"",null,null,null,null,null,null,null,null,null,null,null,null,null,null,null,null,null,null,null,{"$error":"#DIV/0!"}]
[82,"X-2",null,null,null,null,null,null,"2013-07-24",2013,"",null,null,null,null,null,null,null,null,null,null,null,null,null,null,null,null,null,null,null,{"$error":"#DIV/0!"}]
[83,"X-2",null,null,null,null,null,null,{"$f":"TODAY()","v":"2013-07-24"},2013,""]
[84,"X-2",null,null,null,null,null,null,"2013-07-24",2013,""]
[85,"X-2",null,null,null,null,null,null,"2013-07-24",2013,""]
[86,"X-2",null,null,null,null,null,null,"2013-07-24",2013,""]
[87,"X-2",null,null,null,null,null,null,"2013-07-24",2013,"",null,null,null,null,null,null,null,null,null,null,null,null,null,{"$f":"+INPUT!$D$7","v":"Tina Martiana,S.Pd"},{"$f":"+INPUT!$E$7","v":"Penata Muda"}]
[88,"X-2",null,null,null,null,null,null,"2013-07-24",2013,"",null,null,null,null,null,null,null,null,null,null,null,null,null,{"$f":"+INPUT!$D$7","v":"Tina Martiana,S.Pd"},{"$f":"+INPUT!$E$7","v":"Penata Muda"}]
[89,"X-2",null,null,null,null,null,null,"2013-07-24",2013,"",null,null,null,null,null,null,null,null,null,null,null,null,null,{"$f":"+INPUT!$D$7","v":"Tina Martiana,S.Pd"},{"$f":"+INPUT!$E$7","v":"Penata Muda"}]
[90,"X-2",null,null,null,null,null,null,"2013-07-24",2013,"",null,null,null,null,null,null,null,null,null,null,null,null,null,{"$f":"+INPUT!$D$7","v":"Tina Martiana,S.Pd"},{"$f":"+INPUT!$E$7","v":"Penata Muda"}]
[null,null,null,null,null,{"$f":"COUNTIF(F62:F106,\"L\")","v":1},"Laki-laki",null,"14 Th",{"$f":"+K107/$F$52*100%","v":0},{"$f":"COUNTIF(K62:K106,\"14\")","v":0},null,"BURUH HARIAN",0,null,null,null,null,null,"SMP",{"$f":"COUNTIF(U62:U106,\"SMP\")","v":0},null,{"$f":"COUNTIF(W62:W106,\"Islam\")","v":0}]
[null,null,null,null,null,{"$f":"COUNTIF(F62:F106,\"P\")","v":0},"Perempuan",null,"15 Th",{"$f":"+K108/$F$52*100%","v":1},{"$f":"COUNTIF(K62:K106,\"15\")","v":1},null,"PEG / KARY. SWASTA",0,null,null,null,null,null,"MTs",{"$f":"COUNTIF(U62:U106,\"MTs\")","v":0},null,{"$f":"COUNTIF(W62:W106,\"Katolik\")","v":0}]
[null,null,null,null,null,{"$f":"SUM(F107:F108)","v":1},"Total Siswa",null,"16 Th",{"$f":"+K109/$F$52*100%","v":0},{"$f":"COUNTIF(K62:K106,\"16\")","v":0},null,"PNS",0,null,null,null,null,null,"Lainnya",{"$f":"+U107+U108","v":0},null,{"$f":"COUNTIF(W62:W106,\"Protestan\")","v":0}]
[null,null,null,null,null,null,null,null,"17 Th",0,{"$f":"COUNTIF(K62:K106,\"17\")","v":0},null,"WIRASWASTA",0,null,null,null,null,null,null,null,null,{"$f":"COUNTIF(W62:W106,\"Hindu\")","v":0}]
[null,null,null,null,null,null,null,null,"18 Th",0,{"$f":"COUNTIF(K62:K106,\"18\")","v":0},null,"KARY/ PEGAWAI .BUMN",0,null,null,null,null,null,null,null,null,{"$f":"COUNTIF(W62:W106,\"Budha\")","v":0}]
[null,null,null,null,null,null,null,null,"19 Th",0,{"$f":"COUNTIF(K62:K106,\"13\")","v":0},null,"KEPOLISIAN",0,null,null,null,null,null,null,null,null,{"$f":"SUM(W107:W111)","v":0}]
[null,null,null,null,null,null,null,null,"20 Th",0,{"$f":"COUNTIF(K62:K106,\"20\")","v":0},null,"PENSIUNAN",0]
[null,null,null,null,null,null,null,null,"TOTAL",1,{"$f":"SUM(K107:K113)","v":1},null,"HONORER",0]
[null,null,null,null,null,null,null,null,null,null,null,null,"GURU",0]
[null,null,null,null,null,null,null,null,null,null,null,null,"TAK ADA DATA",0]
[null,null,null,null,null,null,null,null,null,null,null,null,"TOTAL DATA",0]
[null,{"$f":"MAX(A62:A106)","v":90}]
[{"$f":"+$B$118+1","v":91},{"$f":"+INPUT!$C$8","v":"X-3"},"ADE SRI JUA ASIH",13140086,9988413542,"P","CILEGON","1 DESEMBER 1998",{"$f":"TODAY()","v":"2013-07-24"},{"$f":"+$J$3","v":2013},{"$f":"IF(H119=\"\",\"\",DATEDIF(H119,I119,\"y\"))","v":14},null,null,null,null,null,null,null,null,null,null,null,null,null,null,null,null,null,null,null,{"$f":"AVERAGE(AA119:AD119)","v":{"$error":"#DIV/0!"}},null,null,null,{"$f":"+B119","v":"X-3"}]
[{"$f":"+A119+1","v":92},{"$f":"IF(A120=0,\" \",+B119)","v":"X-3"},null,null,null,null,null,null,{"$f":"TODAY()","v":"2013-07-24"},2013,{"$f":"IF(H120=\"\",\"\",DATEDIF(H120,I120,\"y\"))","v":""},null,null,null,null,null,null,null,null,null,null,null,null,null,null,null,null,null,null,null,{"$error":"#DIV/0!"}]
[{"$f":"+A120+1","v":93},{"$f":"IF(A121=0,\" \",+B120)","v":"X-3"},null,null,null,null,null,null,"2013-07-24",2013,"",null,null,null,null,null,null,null,null,null,null,null,null,null,null,null,null,null,null,null,{"$error":"#DIV/0!"}]
[94,{"$f":"IF(A122=0,\" \",+B121)","v":"X-3"},null,null,null,null,null,null,"2013-07-24",2013,"",null,null,null,null,null,null,null,null,null,null,null,null,null,null,null,null,null,null,null,{"$error":"#DIV/0!"}]
[95,"X-3",null,null,null,null,null,null,"2013-07-24",2013,"",null,null,null,null,null,null,null,null,null,null,null,null,null,null,null,null,null,null,null,{"$error":"#DIV/0!"}]
[96,"X-3",null,null,null,null,null,null,"2013-07-24",2013,"",null,null,null,null,null,null,null,null,null,null,null,null,null,null,null,null,null,null,null,{"$error":"#DIV/0!"}]
[97,"X-3",null,null,null,null,null,null,"2013-07-24",2013,"",null,null,null,null,null,null,null,null,null,null,null,null,null,null,null,null,null,null,null,{"$error":"#DIV/0!"}]
[98,"X-3",null,null,null,null,null,null,"2013-07-24",2013,"",null,null,null,null,null,null,null,null,null,null,null,null,null,null,null,null,null,null,null,{"$error":"#DIV/0!"}]
[99,"X-3",null,null,null,null,null,null,"2013-07-24",2013,"",null,null,null,null,null,null,null,null,null,null,null,null,null,null,null,null,null,null,null,{"$error":"#DIV/0!"}]
[100,"X-3",null,null,null,null,null,null,"2013-07-24",2013,"",null,null,null,null,null,null,null,null,null,null,null,null,null,null,null,null,null,null,null,{"$error":"#DIV/0!"}]
[101,"X-3",null,null,null,null,null,null,"2013-07-24",2013,"",null,null,null,null,null,null,null,null,null,null,null,null,null,null,null,null,null,null,null,{"$error":"#DIV/0!"}]
[102,"X-3",null,null,null,null,null,null,"2013-07-24",2013,"",null,null,null,null,null,null,null,null,null,null,null,null,null,null,null,null,null,null,null,{"$error":"#DIV/0!"}]
[103,"X-3",null,null,null,null,null,null,"2013-07-24",2013,"",null,null,null,null,null,null,null,null,null,null,null,null,null,null,null,null,null,null,null,{"$error":"#DIV/0!"}]
[104,"X-3",null,null,null,null,null,null,"2013-07-24",2013,"",null,null,null,null,null,null,null,null,null,null,null,null,null,null,null,null,null,null,null,{"$error":"#DIV/0!"}]
[105,"X-3",null,null,null,null,null,null,"2013-07-24",2013,"",null,null,null,null,null,null,null,null,null,null,null,null,null,null,null,null,null,null,null,{"$error":"#DIV/0!"}]
[106,"X-3",null,null,null,null,null,null,"2013-07-24",2013,"",null,null,null,null,null,null,null,null,null,null,null,null,null,null,null,null,null,null,null,{"$error":"#DIV/0!"}]
[107,"X-3",null,null,null,null,null,null,"2013-07-24",2013,"",null,null,null,null,null,null,null,null,null,null,null,null,null,null,null,null,null,null,null,{"$error":"#DIV/0!"}]
[108,"X-3",null,null,null,null,null,null,"2013-07-24",2013,"",null,null,null,null,null,null,null,null,null,null,null,null,null,null,null,null,null,null,null,{"$error":"#DIV/0!"}]
[109,"X-3",null,null,null,null,null,null,"2013-07-24",2013,"",null,null,null,null,null,null,null,null,null,null,null,null,null,null,null,null,null,null,null,{"$error":"#DIV/0!"}]
[110,"X-3",null,null,null,null,null,null,"2013-07-24",2013,"",null,null,null,null,null,null,null,null,null,null,null,null,null,null,null,null,null,null,null,{"$error":"#DIV/0!"}]
[111,"X-3",null,null,null,null,null,null,"2013-07-24",2013,"",null,null,null,null,null,null,null,null,null,null,null,null,null,null,null,null,null,null,null,{"$error":"#DIV/0!"}]
[112,"X-3",null,null,null,null,null,null,"2013-07-24",2013,"",null,null,null,null,null,null,null,null,null,null,null,null,null,null,null,null,null,null,null,{"$error":"#DIV/0!"}]
[113,"X-3",null,null,null,null,null,null,"2013-07-24",2013,"",null,null,null,null,null,null,null,null,null,null,null,null,null,null,null,null,null,null,null,{"$error":"#DIV/0!"}]
[114,"X-3",null,null,null,null,null,null,"2013-07-24",2013,"",null,null,null,null,null,null,null,null,null,null,null,null,null,null,null,null,null,null,null,{"$error":"#DIV/0!"}]
[115,"X-3",null,null,null,null,null,null,"2013-07-24",2013,"",null,null,null,null,null,null,null,null,null,null,null,null,null,null,null,null,null,null,null,{"$error":"#DIV/0!"}]
[116,"X-3",null,null,null,null,null,null,"2013-07-24",2013,"",null,null,null,null,null,null,null,null,null,null,null,null,null,null,null,null,null,null,null,{"$error":"#DIV/0!"}]
[117,"X-3",null,null,null,null,null,null,"2013-07-24",2013,"",null,null,null,null,null,null,null,null,null,null,null,null,null,null,null,null,null,null,null,{"$error":"#DIV/0!"}]
[118,"X-3",null,null,null,null,null,null,"2013-07-24",2013,"",null,null,null,null,null,null,null,null,null,null,null,null,null,null,null,null,null,null,null,{"$error":"#DIV/0!"}]
[119,"X-3",null,null,null,null,null,null,"2013-07-24",2013,"",null,null,null,null,null,null,null,null,null,null,null,null,null,null,null,null,null,null,null,{"$error":"#DIV/0!"}]
[120,"X-3",null,null,null,null,null,null,"2013-07-24",2013,"",null,null,null,null,null,null,null,null,null,null,null,null,null,null,null,null,null,null,null,{"$error":"#DIV/0!"}]
[121,"X-3",null,null,null,null,null,null,"2013-07-24",2013,"",null,null,null,null,null,null,null,null,null,null,null,null,null,null,null,null,null,null,null,{"$error":"#DIV/0!"}]
[122,"X-3",null,null,null,null,null,null,"2013-07-24",2013,"",null,null,null,null,null,null,null,null,null,null,null,null,null,null,null,null,null,null,null,{"$error":"#DIV/0!"}]
[123,"X-3",null,null,null,null,null,null,"2013-07-24",2013,"",null,null,null,null,null,null,null,null,null,null,null,null,null,null,null,null,null,null,null,{"$error":"#DIV/0!"}]
[124,"X-3",null,null,null,null,null,null,"2013-07-24",2013,""]
[125,"X-3",null,null,null,null,null,null,"2013-07-24",2013,"",null,null,null,null,null,null,null,null,null,null,null,null,null,null,null,null,null,null,null,{"$f":"AVERAGE(AA153:AD153)","v":{"$error":"#DIV/0!"}}]
[126,"X-3",null,null,null,null,null,null,"2013-07-24",2013,"",null,null,null,null,null,null,null,null,null,null,null,null,null,null,null,null,null,null,null,{"$f":"AVERAGE(AA154:AD154)","v":{"$error":"#DIV/0!"}}]
[127,"X-3",null,null,null,null,null,null,"2013-07-24",2013,"",null,null,null,null,null,null,null,null,null,null,null,null,null,null,null,null,null,null,null,{"$f":"AVERAGE(AA155:AD155)","v":{"$error":"#DIV/0!"}}]
[128,"X-3",null,null,null,null,null,null,{"$f":"TODAY()","v":"2013-07-24"},2013,"",null,null,null,null,null,null,null,null,null,null,null,null,null,null,null,null,null,null,null,{"$f":"AVERAGE(AA156:AD156)","v":{"$error":"#DIV/0!"}}]
[129,"X-3",null,null,null,null,null,null,"2013-07-24",2013,""]
[130,"X-3",null,null,null,null,null,null,"2013-07-24",2013,""]
[131,"X-3",null,null,null,null,null,null,"2013-07-24",2013,""]
[132,"X-3",null,null,null,null,null,null,"2013-07-24",2013,"",null,null,null,null,null,null,null,null,null,null,null,null,null,{"$f":"+INPUT!$D$8","v":"Apriyani Dewi Mayasari,M.Pd"},{"$f":"+INPUT!$E$8","v":"Penata Muda"}]
[133,"X-3",null,null,null,null,null,null,"2013-07-24",2013,"",null,null,null,null,null,null,null,null,null,null,null,null,null,{"$f":"+INPUT!$D$8","v":"Apriyani Dewi Mayasari,M.Pd"},{"$f":"+INPUT!$E$8","v":"Penata Muda"}]
[134,"X-3",null,null,null,null,null,null,"2013-07-24",2013,"",null,null,null,null,null,null,null,null,null,null,null,null,null,{"$f":"+INPUT!$D$8","v":"Apriyani Dewi Mayasari,M.Pd"},{"$f":"+INPUT!$E$8","v":"Penata Muda"}]
[135,"X-3",null,null,null,null,null,null,"2013-07-24",2013,"",null,null,null,null,null,null,null,null,null,null,null,null,null,{"$f":"+INPUT!$D$8","v":"Apriyani Dewi Mayasari,M.Pd"},{"$f":"+INPUT!$E$8","v":"Penata Muda"}]
[null,null,null,null,null,{"$f":"COUNTIF(F119:F163,\"L\")","v":0},"Laki-laki",null,"14 Th",{"$f":"+K164/$F$52*100%","v":1},{"$f":"COUNTIF(K119:K163,\"14\")","v":1},null,"BURUH HARIAN",0,null,null,null,null,null,"SMP",{"$f":"COUNTIF(U119:U163,\"SMP\")","v":0},"Islam",{"$f":"COUNTIF(W119:W163,\"Islam\")","v":0},null,{"$f":"+INPUT!$D$8","v":"Apriyani Dewi Mayasari,M.Pd"}]
[null,null,null,null,null,{"$f":"COUNTIF(F119:F163,\"P\")","v":1},"Perempuan",null,"15 Th",{"$f":"+K165/$F$52*100%","v":0},{"$f":"COUNTIF(K119:K163,\"15\")","v":0},null,"PEG / KARY. SWASTA",0,null,null,null,null,null,"MTs",{"$f":"COUNTIF(U119:U163,\"MTs\")","v":0},"Katolik",{"$f":"COUNTIF(W119:W163,\"Katolik\")","v":0},null,{"$f":"+INPUT!$D$8","v":"Apriyani Dewi Mayasari,M.Pd"}]
[null,null,null,null,null,{"$f":"SUM(F164:F165)","v":1},"Total Siswa",null,"16 Th",{"$f":"+K166/$F$52*100%","v":0},{"$f":"COUNTIF(K119:K163,\"16\")","v":0},null,"PNS",0,null,null,null,null,null,"Lainnya",{"$f":"+U164+U165","v":0},"Protestan",{"$f":"COUNTIF(W119:W163,\"Protestan\")","v":0},null,{"$f":"+INPUT!$D$8","v":"Apriyani Dewi Mayasari,M.Pd"}]
[null,null,null,null,null,null,null,null,"17 Th",0,{"$f":"COUNTIF(K119:K163,\"17\")","v":0},null,"WIRASWASTA",0,null,null,null,null,null,null,null,"Hindu",{"$f":"COUNTIF(W119:W163,\"Hindu\")","v":0},null,{"$f":"+INPUT!$D$8","v":"Apriyani Dewi Mayasari,M.Pd"}]
[null,null,null,null,null,null,null,null,"18 Th",0,{"$f":"COUNTIF(K119:K163,\"18\")","v":0},null,"KARY/ PEGAWAI .BUMN",0,null,null,null,null,null,null,null,"Budha",{"$f":"COUNTIF(W119:W163,\"Budha\")","v":0},null,{"$f":"+INPUT!$D$8","v":"Apriyani Dewi Mayasari,M.Pd"}]
[null,null,null,null,null,null,null,null,"19 Th",0,{"$f":"COUNTIF(K119:K163,\"13\")","v":0},null,"KEPOLISIAN",0,null,null,null,null,null,null,null,null,{"$f":"SUM(W164:W168)","v":0},null,{"$f":"+INPUT!$D$8","v":"Apriyani Dewi Mayasari,M.Pd"}]
[null,null,null,null,null,null,null,null,"20 Th",0,{"$f":"COUNTIF(K119:K163,\"19\")","v":0},null,"PENSIUNAN",0,null,null,null,null,null,null,null,null,null,null,{"$f":"+INPUT!$D$8","v":"Apriyani Dewi Mayasari,M.Pd"}]
[null,null,null,null,null,null,null,null,"TOTAL",1,{"$f":"SUM(K164:K170)","v":1},null,"HONORER",0,null,null,null,null,null,null,null,null,null,null,{"$f":"+INPUT!$D$8","v":"Apriyani Dewi Mayasari,M.Pd"}]
[null,null,null,null,null,null,null,null,null,null,null,null,"GURU",0,null,null,null,null,null,null,null,null,null,null,{"$f":"+INPUT!$D$8","v":"Apriyani Dewi Mayasari,M.Pd"}]
[null,null,null,null,null,null,null,null,null,null,null,null,"TAK ADA DATA",0,null,null,null,null,null,null,null,null,null,null,{"$f":"+INPUT!$D$8","v":"Apriyani Dewi Mayasari,M.Pd"}]
[null,null,null,null,null,null,null,null,null,null,null,null,"TOTAL DATA",0,null,null,null,null,null,null,null,null,null,null,{"$f":"+INPUT!$D$8","v":"Apriyani Dewi Mayasari,M.Pd"}]
[null,{"$f":"MAX(A119:A163)","v":135},null,null,null,null,null,null,null,null,null,null,null,null,null,null,null,null,null,null,null,null,null,null,{"$f":"+INPUT!$D$8","v":"Apriyani Dewi Mayasari,M.Pd"}]
[{"$f":"+$B$175+1","v":136},{"$f":"+INPUT!$C$9","v":"X-4"},"ADE ISWANDI",13140131,"9980450221","L","CILEGON","1999-01-01",{"$f":"TODAY()","v":"2013-07-24"},{"$f":"+$J$3","v":2013},{"$f":"IF(H176=\"\",\"\",DATEDIF(H176,I176,\"y\"))","v":14},null,null,null,null,null,null,null,null,null,null,null,null,null,null,null,null,null,null,null,{"$f":"AVERAGE(AA176:AD176)","v":{"$error":"#DIV/0!"}},null,null,null,{"$f":"+B176","v":"X-4"}]
[{"$f":"+A176+1","v":137},{"$f":"IF(A177=0,\" \",+B176)","v":"X-4"},null,null,null,null,null,null,{"$f":"TODAY()","v":"2013-07-24"},2013,{"$f":"IF(H177=\"\",\"\",DATEDIF(H177,I177,\"y\"))","v":""},null,null,null,null,null,null,null,null,null,null,null,null,null,null,null,null,null,null,null,{"$error":"#DIV/0!"}]
[{"$f":"+A177+1","v":138},{"$f":"IF(A178=0,\" \",+B177)","v":"X-4"},null,null,null,null,null,null,"2013-07-24",2013,"",null,null,null,null,null,null,null,null,null,null,null,null,null,null,null,null,null,null,null,{"$error":"#DIV/0!"}]
[139,{"$f":"IF(A179=0,\" \",+B178)","v":"X-4"},null,null,null,null,null,null,"2013-07-24",2013,"",null,null,null,null,null,null,null,null,null,null,null,null,null,null,null,null,null,null,null,{"$error":"#DIV/0!"}]
[140,"X-4",null,null,null,null,null,null,"2013-07-24",2013,"",null,null,null,null,null,null,null,null,null,null,null,null,null,null,null,null,null,null,null,{"$error":"#DIV/0!"}]
[141,"X-4",null,null,null,null,null,null,"2013-07-24",2013,"",null,null,null,null,null,null,null,null,null,null,null,null,null,null,null,null,null,null,null,{"$error":"#DIV/0!"}]
[142,"X-4",null,null,null,null,null,null,"2013-07-24",2013,""]
[143,"X-4",null,null,null,null,null,null,"2013-07-24",2013,"",null,null,null,null,null,null,null,null,null,null,null,null,null,null,null,null,null,null,null,{"$f":"AVERAGE(AA183:AD183)","v":{"$error":"#DIV/0!"}}]
[144,"X-4",null,null,null,null,null,null,"2013-07-24",2013,"",null,null,null,null,null,null,null,null,null,null,null,null,null,null,null,null,null,null,null,{"$error":"#DIV/0!"}]
[145,"X-4",null,null,null,null,null,null,"2013-07-24",2013,"",null,null,null,null,null,null,null,null,null,null,null,null,null,null,null,null,null,null,null,{"$error":"#DIV/0!"}]
[146,"X-4",null,null,null,null,null,null,"2013-07-24",2013,"",null,null,null,null,null,null,null,null,null,null,null,null,null,null,null,null,null,null,null,{"$error":"#DIV/0!"}]
[147,"X-4",null,null,null,null,null,null,"2013-07-24",2013,"",null,null,null,null,null,null,null,null,null,null,null,null,null,null,null,null,null,null,null,{"$error":"#DIV/0!"}]
[148,"X-4",null,null,null,null,null,null,"2013-07-24",2013,"",null,null,null,null,null,null,null,null,null,null,null,null,null,null,null,null,null,null,null,{"$error":"#DIV/0!"}]
[149,"X-4",null,null,null,null,null,null,"2013-07-24",2013,"",null,null,null,null,null,null,null,null,null,null,null,null,null,null,null,null,null,null,null,{"$error":"#DIV/0!"}]
[150,"X-4",null,null,null,null,null,null,"2013-07-24",2013,"",null,null,null,null,null,null,null,null,null,null,null,null,null,null,null,null,null,null,null,{"$error":"#DIV/0!"}]
[151,"X-4",null,null,null,null,null,null,"2013-07-24",2013,"",null,null,null,null,null,null,null,null,null,null,null,null,null,null,null,null,null,null,null,{"$error":"#DIV/0!"}]
[152,"X-4",null,null,null,null,null,null,"2013-07-24",2013,"",null,null,null,null,null,null,null,null,null,null,null,null,null,null,null,null,null,null,null,{"$error":"#DIV/0!"}]
[153,"X-4",null,null,null,null,null,null,"2013-07-24",2013,"",null,null,null,null,null,null,null,null,null,null,null,null,null,null,null,null,null,null,null,{"$error":"#DIV/0!"}]
[154,"X-4",null,null,null,null,null,null,"2013-07-24",2013,"",null,null,null,null,null,null,null,null,null,null,null,null,null,null,null,null,null,null,null,{"$error":"#DIV/0!"}]
[155,"X-4",null,null,null,null,null,null,"2013-07-24",2013,"",null,null,null,null,null,null,null,null,null,null,null,null,null,null,null,null,null,null,null,{"$error":"#DIV/0!"}]
[156,"X-4",null,null,null,null,null,null,"2013-07-24",2013,"",null,null,null,null,null,null,null,null,null,null,null,null,null,null,null,null,null,null,null,{"$error":"#DIV/0!"}]
[157,"X-4",null,null,null,null,null,null,"2013-07-24",2013,"",null,null,null,null,null,null,null,null,null,null,null,null,null,null,null,null,null,null,null,{"$error":"#DIV/0!"}]
[158,"X-4",null,null,null,null,null,null,"2013-07-24",2013,"",null,null,null,null,null,null,null,null,null,null,null,null,null,null,null,null,null,null,null,{"$error":"#DIV/0!"}]
[159,"X-4",null,null,null,null,null,null,"2013-07-24",2013,"",null,null,null,null,null,null,null,null,null,null,null,null,null,null,null,null,null,null,null,{"$error":"#DIV/0!"}]
[160,"X-4",null,null,null,null,null,null,"2013-07-24",2013,"",null,null,null,null,null,null,null,null,null,null,null,null,null,null,null,null,null,null,null,{"$error":"#DIV/0!"}]
[161,"X-4",null,null,null,null,null,null,"2013-07-24",2013,"",null,null,null,null,null,null,null,null,null,null,null,null,null,null,null,null,null,null,null,{"$error":"#DIV/0!"}]
[162,"X-4",null,null,null,null,null,null,"2013-07-24",2013,"",null,null,null,null,null,null,null,null,null,null,null,null,null,null,null,null,null,null,null,{"$error":"#DIV/0!"}]
[163,"X-4",null,null,null,null,null,null,"2013-07-24",2013,"",null,null,null,null,null,null,null,null,null,null,null,null,null,null,null,null,null,null,null,{"$error":"#DIV/0!"}]
[164,"X-4",null,null,null,null,null,null,"2013-07-24",2013,"",null,null,null,null,null,null,null,null,null,null,null,null,null,null,null,null,null,null,null,{"$error":"#DIV/0!"}]
[165,"X-4",null,null,null,null,null,null,"2013-07-24",2013,"",null,null,null,null,null,null,null,null,null,null,null,null,null,null,null,null,null,null,null,{"$error":"#DIV/0!"}]
[166,"X-4",null,null,null,null,null,null,"2013-07-24",2013,"",null,null,null,null,null,null,null,null,null,null,null,null,null,null,null,null,null,null,null,{"$error":"#DIV/0!"}]
[167,"X-4",null,null,null,null,null,null,"2013-07-24",2013,"",null,null,null,null,null,null,null,null,null,null,null,null,null,null,null,null,null,null,null,{"$error":"#DIV/0!"}]
[168,"X-4",null,null,null,null,null,null,"2013-07-24",2013,"",null,null,null,null,null,null,null,null,null,null,null,null,null,null,null,null,null,null,null,{"$error":"#DIV/0!"}]
[169,"X-4",null,null,null,null,null,null,"2013-07-24",2013,"",null,null,null,null,null,null,null,null,null,null,null,null,null,null,null,null,null,null,null,{"$error":"#DIV/0!"}]
[170,"X-4",null,null,null,null,null,null,"2013-07-24",2013,"",null,null,null,null,null,null,null,null,null,null,null,null,null,null,null,null,null,null,null,{"$error":"#DIV/0!"}]
[171,"X-4",null,null,null,null,null,null,"2013-07-24",2013,"",null,null,null,null,null,null,null,null,null,null,null,null,null,null,null,null,null,null,null,{"$error":"#DIV/0!"}]
[172,"X-4",null,null,null,null,null,null,"2013-07-24",2013,"",null,null,null,null,null,null,null,null,null,null,null,null,null,null,null,null,null,null,null,{"$error":"#DIV/0!"}]
[173,"X-4",null,null,null,null,null,null,{"$f":"TODAY()","v":"2013-07-24"},2013,"",null,null,null,null,null,null,null,null,null,null,null,null,null,null,null,null,null,null,null,{"$error":"#DIV/0!"}]
[174,"X-4",null,null,null,null,null,null,"2013-07-24",2013,""]
[175,"X-4",null,null,null,null,null,null,"2013-07-24",2013,""]
[176,"X-4",null,null,null,null,null,null,"2013-07-24",2013,""]
[177,"X-4",null,null,null,null,null,null,"2013-07-24",2013,"",null,null,null,null,null,null,null,null,null,null,null,null,null,{"$f":"+INPUT!$D$9","v":"Rochma,S.Pd"},{"$f":"+INPUT!$E$9","v":"Guru Madya Tk I"}]
[178,"X-4",null,null,null,null,null,null,"2013-07-24",2013,"",null,null,null,null,null,null,null,null,null,null,null,null,null,{"$f":"+INPUT!$D$9","v":"Rochma,S.Pd"},{"$f":"+INPUT!$E$9","v":"Guru Madya Tk I"}]
[179,"X-4",null,null,null,null,null,null,"2013-07-24",2013,"",null,null,null,null,null,null,null,null,null,null,null,null,null,{"$f":"+INPUT!$D$9","v":"Rochma,S.Pd"},{"$f":"+INPUT!$E$9","v":"Guru Madya Tk I"}]
[180,"X-4",null,null,null,null,null,null,"2013-07-24",2013,"",null,null,null,null,null,null,null,null,null,null,null,null,null,{"$f":"+INPUT!$D$9","v":"Rochma,S.Pd"},{"$f":"+INPUT!$E$9","v":"Guru Madya Tk I"}]
[null,null,null,null,null,{"$f":"COUNTIF(F176:F220,\"L\")","v":1},"Laki-laki",null,"14 Th",{"$f":"+K221/$F$52*100%","v":1},{"$f":"COUNTIF(K176:K220,\"14\")","v":1},null,null,null,null,null,null,null,null,"SMP",{"$f":"COUNTIF(U176:U220,\"SMP\")","v":0},"Islam",{"$f":"COUNTIF(W176:W220,\"Islam\")","v":0}]
[null,null,null,null,null,{"$f":"COUNTIF(F176:F220,\"P\")","v":0},"Perempuan",null,"15 Th",{"$f":"+K222/$F$52*100%","v":0},{"$f":"COUNTIF(K176:K220,\"15\")","v":0},null,null,null,null,null,null,null,null,"MTs",{"$f":"COUNTIF(U176:U220,\"MTs\")","v":0},"Katolik",{"$f":"COUNTIF(W176:W220,\"Katolik\")","v":0}]
[null,null,null,null,null,{"$f":"SUM(F221:F222)","v":1},"Total Siswa",null,"16 Th",{"$f":"+K223/$F$52*100%","v":0},{"$f":"COUNTIF(K176:K220,\"16\")","v":0},null,null,null,null,null,null,null,null,"Lainnya",{"$f":"+U221+U222","v":0},"Protestan",{"$f":"COUNTIF(W176:W220,\"Protestan\")","v":0}]
[null,null,null,null,null,null,null,null,"17 Th",0,{"$f":"COUNTIF(K176:K220,\"17\")","v":0},null,null,null,null,null,null,null,null,null,null,"Hindu",{"$f":"COUNTIF(W176:W220,\"Hindu\")","v":0}]
[null,null,null,null,null,null,null,null,"18 Th",0,{"$f":"COUNTIF(K176:K220,\"18\")","v":0},null,null,null,null,null,null,null,null,null,null,"Budha",{"$f":"COUNTIF(W176:W220,\"Budha\")","v":0}]
[null,null,null,null,null,null,null,null,"19 Th",0,{"$f":"COUNTIF(K176:K220,\"13\")","v":0},null,null,null,null,null,null,null,null,null,null,null,{"$f":"SUM(W221:W225)","v":0}]
[null,null,null,null,null,null,null,null,"20 Th",0,{"$f":"COUNTIF(K176:K220,\"19\")","v":0}]
[null,null,null,null,null,null,null,null,"TOTAL",1,{"$f":"SUM(K221:K227)","v":1}]
[]
[]
[]
[null,{"$f":"MAX(A176:A220)","v":180}]
[{"$f":"+$B$232+1","v":181},{"$f":"+INPUT!$C$10","v":"X-5"},"ABDUS SALAM",13140160,"9985058275","L","CILEGON","1998-06-25",{"$f":"TODAY()","v":"2013-07-24"},{"$f":"+$J$3","v":2013},{"$f":"IF(H233=\"\",\"\",DATEDIF(H233,I233,\"y\"))","v":15},null,null,null,null,null,null,null,null,null,null,null,null,null,null,null,null,null,null,null,{"$f":"AVERAGE(AA233:AD233)","v":{"$error":"#DIV/0!"}},null,null,null,{"$f":"+B233","v":"X-5"}]
[{"$f":"+A233+1","v":182},{"$f":"IF(A234=0,\" \",+B233)","v":"X-5"},null,null,null,null,null,null,{"$f":"TODAY()","v":"2013-07-24"},2013,{"$f":"IF(H234=\"\",\"\",DATEDIF(H234,I234,\"y\"))","v":""},null,null,null,null,null,null,null,null,null,null,null,null,null,null,null,null,null,null,null,{"$f":"AVERAGE(AA234:AD234)","v":{"$error":"#DIV/0!"}}]
[{"$f":"+A234+1","v":183},{"$f":"IF(A235=0,\" \",+B234)","v":"X-5"},null,null,null,null,null,null,"2013-07-24",2013,"",null,null,null,null,null,null,null,null,null,null,null,null,null,null,null,null,null,null,null,{"$f":"AVERAGE(AA235:AD235)","v":{"$error":"#DIV/0!"}}]
[184,{"$f":"IF(A236=0,\" \",+B235)","v":"X-5"},null,null,null,null,null,null,"2013-07-24",2013,"",null,null,null,null,null,null,null,null,null,null,null,null,null,null,null,null,null,null,null,{"$f":"AVERAGE(AA236:AD236)","v":{"$error":"#DIV/0!"}}]
[185,"X-5",null,null,null,null,null,null,"2013-07-24",2013,"",null,null,null,null,null,null,null,null,null,null,null,null,null,null,null,null,null,null,null,{"$f":"AVERAGE(AA237:AD237)","v":{"$error":"#DIV/0!"}}]
[186,"X-5",null,null,null,null,null,null,"2013-07-24",2013,""]
[187,"X-5",null,null,null,null,null,null,"2013-07-24",2013,"",null,null,null,null,null,null,null,null,null,null,null,null,null,null,null,null,null,null,null,{"$f":"AVERAGE(AA239:AD239)","v":{"$error":"#DIV/0!"}}]
[188,"X-5",null,null,null,null,null,null,"2013-07-24",2013,"",null,null,null,null,null,null,null,null,null,null,null,null,null,null,null,null,null,null,null,{"$error":"#DIV/0!"}]
[189,"X-5",null,null,null,null,null,null,"2013-07-24",2013,"",null,null,null,null,null,null,null,null,null,null,null,null,null,null,null,null,null,null,null,{"$error":"#DIV/0!"}]
[190,"X-5",null,null,null,null,null,null,"2013-07-24",2013,"",null,null,null,null,null,null,null,null,null,null,null,null,null,null,null,null,null,null,null,{"$error":"#DIV/0!"}]
[191,"X-5",null,null,null,null,null,null,"2013-07-24",2013,"",null,null,null,null,null,null,null,null,null,null,null,null,null,null,null,null,null,null,null,{"$error":"#DIV/0!"}]
[192,"X-5",null,null,null,null,null,null,"2013-07-24",2013,"",null,null,null,null,null,null,null,null,null,null,null,null,null,null,null,null,null,null,null,{"$error":"#DIV/0!"}]
[193,"X-5",null,null,null,null,null,null,"2013-07-24",2013,"",null,null,null,null,null,null,null,null,null,null,null,null,null,null,null,null,null,null,null,{"$error":"#DIV/0!"}]
[194,"X-5",null,null,null,null,null,null,"2013-07-24",2013,"",null,null,null,null,null,null,null,null,null,null,null,null,null,null,null,null,null,null,null,{"$error":"#DIV/0!"}]
[195,"X-5",null,null,null,null,null,null,"2013-07-24",2013,"",null,null,null,null,null,null,null,null,null,null,null,null,null,null,null,null,null,null,null,{"$error":"#DIV/0!"}]
[196,"X-5",null,null,null,null,null,null,"2013-07-24",2013,"",null,null,null,null,null,null,null,null,null,null,null,null,null,null,null,null,null,null,null,{"$error":"#DIV/0!"}]
[197,"X-5",null,null,null,null,null,null,"2013-07-24",2013,"",null,null,null,null,null,null,null,null,null,null,null,null,null,null,null,null,null,null,null,{"$error":"#DIV/0!"}]
[198,"X-5",null,null,null,null,null,null,"2013-07-24",2013,"",null,null,null,null,null,null,null,null,null,null,null,null,null,null,null,null,null,null,null,{"$error":"#DIV/0!"}]
[199,"X-5",null,null,null,null,null,null,"2013-07-24",2013,"",null,null,null,null,null,null,null,null,null,null,null,null,null,null,null,null,null,null,null,{"$error":"#DIV/0!"}]
[200,"X-5",null,null,null,null,null,null,"2013-07-24",2013,"",null,null,null,null,null,null,null,null,null,null,null,null,null,null,null,null,null,null,null,{"$error":"#DIV/0!"}]
[201,"X-5",null,null,null,null,null,null,"2013-07-24",2013,"",null,null,null,null,null,null,null,null,null,null,null,null,null,null,null,null,null,null,null,{"$error":"#DIV/0!"}]
[202,"X-5",null,null,null,null,null,null,"2013-07-24",2013,"",null,null,null,null,null,null,null,null,null,null,null,null,null,null,null,null,null,null,null,{"$error":"#DIV/0!"}]
[203,"X-5",null,null,null,null,null,null,"2013-07-24",2013,"",null,null,null,null,null,null,null,null,null,null,null,null,null,null,null,null,null,null,null,{"$error":"#DIV/0!"}]
[204,"X-5",null,null,null,null,null,null,"2013-07-24",2013,"",null,null,null,null,null,null,null,null,null,null,null,null,null,null,null,null,null,null,null,{"$error":"#DIV/0!"}]
[205,"X-5",null,null,null,null,null,null,"2013-07-24",2013,"",null,null,null,null,null,null,null,null,null,null,null,null,null,null,null,null,null,null,null,{"$error":"#DIV/0!"}]
[206,"X-5",null,null,null,null,null,null,"2013-07-24",2013,"",null,null,null,null,null,null,null,null,null,null,null,null,null,null,null,null,null,null,null,{"$error":"#DIV/0!"}]
[207,"X-5",null,null,null,null,null,null,"2013-07-24",2013,"",null,null,null,null,null,null,null,null,null,null,null,null,null,null,null,null,null,null,null,{"$error":"#DIV/0!"}]
[208,"X-5",null,null,null,null,null,null,"2013-07-24",2013,"",null,null,null,null,null,null,null,null,null,null,null,null,null,null,null,null,null,null,null,{"$error":"#DIV/0!"}]
[209,"X-5",null,null,null,null,null,null,"2013-07-24",2013,"",null,null,null,null,null,null,null,null,null,null,null,null,null,null,null,null,null,null,null,{"$error":"#DIV/0!"}]
[210,"X-5",null,null,null,null,null,null,"2013-07-24",2013,"",null,null,null,null,null,null,null,null,null,null,null,null,null,null,null,null,null,null,null,{"$error":"#DIV/0!"}]
[211,"X-5",null,null,null,null,null,null,"2013-07-24",2013,"",null,null,null,null,null,null,null,null,null,null,null,null,null,null,null,null,null,null,null,{"$error":"#DIV/0!"}]
[212,"X-5",null,null,null,null,null,null,"2013-07-24",2013,"",null,null,null,null,null,null,null,null,null,null,null,null,null,null,null,null,null,null,null,{"$error":"#DIV/0!"}]
[213,"X-5",null,null,null,null,null,null,"2013-07-24",2013,"",null,null,null,null,null,null,null,null,null,null,null,null,null,null,null,null,null,null,null,{"$error":"#DIV/0!"}]
[214,"X-5",null,null,null,null,null,null,"2013-07-24",2013,"",null,null,null,null,null,null,null,null,null,null,null,null,null,null,null,null,null,null,null,{"$error":"#DIV/0!"}]
[215,"X-5",null,null,null,null,null,null,"2013-07-24",2013,"",null,null,null,null,null,null,null,null,null,null,null,null,null,null,null,null,null,null,null,{"$error":"#DIV/0!"}]
[216,"X-5",null,null,null,null,null,null,"2013-07-24",2013,"",null,null,null,null,null,null,null,null,null,null,null,null,null,null,null,null,null,null,null,{"$error":"#DIV/0!"}]
[217,"X-5",null,null,null,null,null,null,"2013-07-24",2013,"",null,null,null,null,null,null,null,null,null,null,null,null,null,null,null,null,null,null,null,{"$error":"#DIV/0!"}]
[218,"X-5",null,null,null,null,null,null,{"$f":"TODAY()","v":"2013-07-24"},2013,"",null,null,null,null,null,null,null,null,null,null,null,null,null,null,null,null,null,null,null,{"$error":"#DIV/0!"}]
[219,"X-5",null,null,null,null,null,null,"2013-07-24",2013,""]
[220,"X-5",null,null,null,null,null,null,"2013-07-24",2013,""]
[221,"X-5",null,null,null,null,null,null,"2013-07-24",2013,""]
[222,"X-5",null,null,null,null,null,null,"2013-07-24",2013,"",null,null,null,null,null,null,null,null,null,null,null,null,null,{"$f":"+INPUT!$D$10","v":"Rukyati,S.Pd"},{"$f":"+INPUT!$E$10","v":"Guru Madya Tk I"}]
[223,"X-5",null,null,null,null,null,null,"2013-07-24",2013,"",null,null,null,null,null,null,null,null,null,null,null,null,null,{"$f":"+INPUT!$D$10","v":"Rukyati,S.Pd"},{"$f":"+INPUT!$E$10","v":"Guru Madya Tk I"}]
[224,"X-5",null,null,null,null,null,null,"2013-07-24",2013,"",null,null,null,null,null,null,null,null,null,null,null,null,null,{"$f":"+INPUT!$D$10","v":"Rukyati,S.Pd"},{"$f":"+INPUT!$E$10","v":"Guru Madya Tk I"}]
[225,"X-5",null,null,null,null,null,null,"2013-07-24",2013,"",null,null,null,null,null,null,null,null,null,null,null,null,null,{"$f":"+INPUT!$D$10","v":"Rukyati,S.Pd"},{"$f":"+INPUT!$E$10","v":"Guru Madya Tk I"}]
[null,null,null,null,null,{"$f":"COUNTIF(F233:F277,\"L\")","v":1},"Laki-laki",null,"14 Th",{"$f":"+K278/$F$52*100%","v":0},{"$f":"COUNTIF(K233:K277,\"14\")","v":0},null,null,null,null,null,null,null,null,"SMP",{"$f":"COUNTIF(U233:U277,\"SMP\")","v":0},"Islam",{"$f":"COUNTIF(W233:W277,\"Islam\")","v":0},null,null,{"$f":"+INPUT!$E$10","v":"Guru Madya Tk I"}]
[null,null,null,null,null,{"$f":"COUNTIF(F233:F277,\"P\")","v":0},"Perempuan",null,"15 Th",{"$f":"+K279/$F$52*100%","v":1},{"$f":"COUNTIF(K233:K277,\"15\")","v":1},null,null,null,null,null,null,null,null,"MTs",{"$f":"COUNTIF(U233:U277,\"MTs\")","v":0},"Katolik",{"$f":"COUNTIF(W233:W277,\"Katolik\")","v":0},null,null,{"$f":"+INPUT!$E$10","v":"Guru Madya Tk I"}]
[null,null,null,null,null,{"$f":"SUM(F278:F279)","v":1},"Total Siswa",null,"16 Th",{"$f":"+K280/$F$52*100%","v":0},{"$f":"COUNTIF(K233:K277,\"16\")","v":0},null,null,null,null,null,null,null,null,"Lainnya",{"$f":"+U278+U279","v":0},"Protestan",{"$f":"COUNTIF(W233:W277,\"Protestan\")","v":0},null,null,{"$f":"+INPUT!$E$10","v":"Guru Madya Tk I"}]
[null,null,null,null,null,null,null,null,"17 Th",0,{"$f":"COUNTIF(K233:K277,\"17\")","v":0},null,null,null,null,null,null,null,null,null,null,"Hindu",{"$f":"COUNTIF(W233:W277,\"Hindu\")","v":0},null,null,{"$f":"+INPUT!$E$10","v":"Guru Madya Tk I"}]
[null,null,null,null,null,null,null,null,"18 Th",0,{"$f":"COUNTIF(K233:K277,\"18\")","v":0},null,null,null,null,null,null,null,null,null,null,"Budha",{"$f":"COUNTIF(W233:W277,\"Budha\")","v":0},null,null,{"$f":"+INPUT!$E$10","v":"Guru Madya Tk I"}]
[null,null,null,null,null,null,null,null,"19 Th",0,{"$f":"COUNTIF(K233:K277,\"13\")","v":0},null,null,null,null,null,null,null,null,null,null,null,{"$f":"SUM(W278:W282)","v":0},null,null,{"$f":"+INPUT!$E$10","v":"Guru Madya Tk I"}]
[null,null,null,null,null,null,null,null,"20 Th",0,{"$f":"COUNTIF(K233:K277,\"19\")","v":0},null,null,null,null,null,null,null,null,null,null,null,null,null,null,{"$f":"+INPUT!$E$10","v":"Guru Madya Tk I"}]
[null,null,null,null,null,null,null,null,"TOTAL",1,{"$f":"SUM(K278:K284)","v":1},null,null,null,null,null,null,null,null,null,null,null,null,null,null,{"$f":"+INPUT!$E$10","v":"Guru Madya Tk I"}]
[null,null,null,null,null,null,null,null,null,null,null,null,null,null,null,null,null,null,null,null,null,null,null,null,null,{"$f":"+INPUT!$E$10","v":"Guru Madya Tk I"}]
[null,null,null,null,null,null,null,null,null,null,null,null,null,null,null,null,null,null,null,null,null,null,null,null,null,{"$f":"+INPUT!$E$10","v":"Guru Madya Tk I"}]
[null,null,null,null,null,null,null,null,null,null,null,null,null,null,null,null,null,null,null,null,null,null,null,null,null,{"$f":"+INPUT!$E$10","v":"Guru Madya Tk I"}]
[null,{"$f":"MAX(A233:A277)","v":225},null,null,null,null,null,null,null,null,null,null,null,null,null,null,null,null,null,null,null,null,null,null,null,{"$f":"+INPUT!$E$10","v":"Guru Madya Tk I"}]
[{"$f":"+$B$289+1","v":226},{"$f":"+INPUT!$C$11","v":"X-6"},"ABDUL GOFUR",13140208,"9980452259","L","SERANG","1998-03-03",{"$f":"TODAY()","v":"2013-07-24"},{"$f":"+$J$3","v":2013},{"$f":"IF(H290=\"\",\"\",DATEDIF(H290,I290,\"y\"))","v":15},null,null,null,null,null,null,null,null,null,null,null,null,null,null,null,null,null,null,null,{"$f":"AVERAGE(AA290:AD290)","v":{"$error":"#DIV/0!"}},null,null,null,{"$f":"+B290","v":"X-6"}]
[{"$f":"+A290+1","v":227},{"$f":"IF(A291=0,\" \",+B290)","v":"X-6"},null,null,null,null,null,null,{"$f":"TODAY()","v":"2013-07-24"},2013,{"$f":"IF(H291=\"\",\"\",DATEDIF(H291,I291,\"y\"))","v":""},null,null,null,null,null,null,null,null,null,null,null,null,null,null,null,null,null,null,null,{"$error":"#DIV/0!"}]
[{"$f":"+A291+1","v":228},{"$f":"IF(A292=0,\" \",+B291)","v":"X-6"},null,null,null,null,null,null,"2013-07-24",2013,"",null,null,null,null,null,null,null,null,null,null,null,null,null,null,null,null,null,null,null,{"$error":"#DIV/0!"}]
[229,{"$f":"IF(A293=0,\" \",+B292)","v":"X-6"},null,null,null,null,null,null,"2013-07-24",2013,"",null,null,null,null,null,null,null,null,null,null,null,null,null,null,null,null,null,null,null,{"$error":"#DIV/0!"}]
[230,"X-6",null,null,null,null,null,null,"2013-07-24",2013,"",null,null,null,null,null,null,null,null,null,null,null,null,null,null,null,null,null,null,null,{"$error":"#DIV/0!"}]
[231,"X-6",null,null,null,null,null,null,"2013-07-24",2013,"",null,null,null,null,null,null,null,null,null,null,null,null,null,null,null,null,null,null,null,{"$error":"#DIV/0!"}]
[232,"X-6",null,null,null,null,null,null,"2013-07-24",2013,"",null,null,null,null,null,null,null,null,null,null,null,null,null,null,null,null,null,null,null,{"$error":"#DIV/0!"}]
[233,"X-6",null,null,null,null,null,null,"2013-07-24",2013,"",null,null,null,null,null,null,null,null,null,null,null,null,null,null,null,null,null,null,null,{"$error":"#DIV/0!"}]
[234,"X-6",null,null,null,null,null,null,"2013-07-24",2013,"",null,null,null,null,null,null,null,null,null,null,null,null,null,null,null,null,null,null,null,{"$error":"#DIV/0!"}]
[235,"X-6",null,null,null,null,null,null,"2013-07-24",2013,"",null,null,null,null,null,null,null,null,null,null,null,null,null,null,null,null,null,null,null,{"$error":"#DIV/0!"}]
[236,"X-6",null,null,null,null,null,null,"2013-07-24",2013,"",null,null,null,null,null,null,null,null,null,null,null,null,null,null,null,null,null,null,null,{"$error":"#DIV/0!"}]
[237,"X-6",null,null,null,null,null,null,"2013-07-24",2013,"",null,null,null,null,null,null,null,null,null,null,null,null,null,null,null,null,null,null,null,{"$error":"#DIV/0!"}]
[238,"X-6",null,null,null,null,null,null,"2013-07-24",2013,"",null,null,null,null,null,null,null,null,null,null,null,null,null,null,null,null,null,null,null,{"$error":"#DIV/0!"}]
[239,"X-6",null,null,null,null,null,null,"2013-07-24",2013,"",null,null,null,null,null,null,null,null,null,null,null,null,null,null,null,null,null,null,null,{"$error":"#DIV/0!"}]
[240,"X-6",null,null,null,null,null,null,"2013-07-24",2013,"",null,null,null,null,null,null,null,null,null,null,null,null,null,null,null,null,null,null,null,{"$error":"#DIV/0!"}]
[241,"X-6",null,null,null,null,null,null,"2013-07-24",2013,"",null,null,null,null,null,null,null,null,null,null,null,null,null,null,null,null,null,null,null,{"$error":"#DIV/0!"}]
[242,"X-6",null,null,null,null,null,null,"2013-07-24",2013,"",null,null,null,null,null,null,null,null,null,null,null,null,null,null,null,null,null,null,null,{"$error":"#DIV/0!"}]
[243,"X-6",null,null,null,null,null,null,"2013-07-24",2013,"",null,null,null,null,null,null,null,null,null,null,null,null,null,null,null,null,null,null,null,{"$error":"#DIV/0!"}]
[244,"X-6",null,null,null,null,null,null,"2013-07-24",2013,"",null,null,null,null,null,null,null,null,null,null,null,null,null,null,null,null,null,null,null,{"$error":"#DIV/0!"}]
[245,"X-6",null,null,null,null,null,null,"2013-07-24",2013,"",null,null,null,null,null,null,null,null,null,null,null,null,null,null,null,null,null,null,null,{"$error":"#DIV/0!"}]
[246,"X-6",null,null,null,null,null,null,"2013-07-24",2013,"",null,null,null,null,null,null,null,null,null,null,null,null,null,null,null,null,null,null,null,{"$error":"#DIV/0!"}]
[247,"X-6",null,null,null,null,null,null,"2013-07-24",2013,"",null,null,null,null,null,null,null,null,null,null,null,null,null,null,null,null,null,null,null,{"$error":"#DIV/0!"}]
[248,"X-6",null,null,null,null,null,null,"2013-07-24",2013,"",null,null,null,null,null,null,null,null,null,null,null,null,null,null,null,null,null,null,null,{"$error":"#DIV/0!"}]
[249,"X-6",null,null,null,null,null,null,"2013-07-24",2013,"",null,null,null,null,null,null,null,null,null,null,null,null,null,null,null,null,null,null,null,{"$error":"#DIV/0!"}]
[250,"X-6",null,null,null,null,null,null,"2013-07-24",2013,"",null,null,null,null,null,null,null,null,null,null,null,null,null,null,null,null,null,null,null,{"$error":"#DIV/0!"}]
[251,"X-6",null,null,null,null,null,null,"2013-07-24",2013,"",null,null,null,null,null,null,null,null,null,null,null,null,null,null,null,null,null,null,null,{"$error":"#DIV/0!"}]
[252,"X-6",null,null,null,null,null,null,"2013-07-24",2013,"",null,null,null,null,null,null,null,null,null,null,null,null,null,null,null,null,null,null,null,{"$error":"#DIV/0!"}]
[253,"X-6",null,null,null,null,null,null,"2013-07-24",2013,"",null,null,null,null,null,null,null,null,null,null,null,null,null,null,null,null,null,null,null,{"$error":"#DIV/0!"}]
[254,"X-6",null,null,null,null,null,null,"2013-07-24",2013,"",null,null,null,null,null,null,null,null,null,null,null,null,null,null,null,null,null,null,null,{"$error":"#DIV/0!"}]
[255,"X-6",null,null,null,null,null,null,"2013-07-24",2013,"",null,null,null,null,null,null,null,null,null,null,null,null,null,null,null,null,null,null,null,{"$error":"#DIV/0!"}]
[256,"X-6",null,null,null,null,null,null,"2013-07-24",2013,"",null,null,null,null,null,null,null,null,null,null,null,null,null,null,null,null,null,null,null,{"$error":"#DIV/0!"}]
[257,"X-6",null,null,null,null,null,null,"2013-07-24",2013,"",null,null,null,null,null,null,null,null,null,null,null,null,null,null,null,null,null,null,null,{"$error":"#DIV/0!"}]
[258,"X-6",null,null,null,null,null,null,"2013-07-24",2013,"",null,null,null,null,null,null,null,null,null,null,null,null,null,null,null,null,null,null,null,{"$error":"#DIV/0!"}]
[259,"X-6",null,null,null,null,null,null,"2013-07-24",2013,"",null,null,null,null,null,null,null,null,null,null,null,null,null,null,null,null,null,null,null,{"$error":"#DIV/0!"}]
[260,"X-6",null,null,null,null,null,null,"2013-07-24",2013,"",null,null,null,null,null,null,null,null,null,null,null,null,null,null,null,null,null,null,null,{"$error":"#DIV/0!"}]
[261,"X-6",null,null,null,null,null,null,"2013-07-24",2013,"",null,null,null,null,null,null,null,null,null,null,null,null,null,null,null,null,null,null,null,{"$error":"#DIV/0!"}]
[262,"X-6",null,null,null,null,null,null,"2013-07-24",2013,"",null,null,null,null,null,null,null,null,null,null,null,null,null,null,null,null,null,null,null,{"$error":"#DIV/0!"}]
[263,"X-6",null,null,null,null,null,null,{"$f":"TODAY()","v":"2013-07-24"},2013,"",null,null,null,null,null,null,null,null,null,null,null,null,null,null,null,null,null,null,null,{"$error":"#DIV/0!"}]
[264,"X-6",null,null,null,null,null,null,"2013-07-24",2013,""]
[265,"X-6",null,null,null,null,null,null,"2013-07-24",2013,""]
[266,"X-6",null,null,null,null,null,null,"2013-07-24",2013,""]
[267,"X-6",null,null,null,null,null,null,"2013-07-24",2013,"",null,null,null,null,null,null,null,null,null,null,null,null,null,{"$f":"+INPUT!$D$11","v":"Tati Susilawati,SE"},{"$f":"+INPUT!$E$11","v":"Penata Muda"}]
[268,"X-6",null,null,null,null,null,null,"2013-07-24",2013,"",null,null,null,null,null,null,null,null,null,null,null,null,null,{"$f":"+INPUT!$D$11","v":"Tati Susilawati,SE"},{"$f":"+INPUT!$E$11","v":"Penata Muda"}]
[269,"X-6",null,null,null,null,null,null,"2013-07-24",2013,"",null,null,null,null,null,null,null,null,null,null,null,null,null,{"$f":"+INPUT!$D$11","v":"Tati Susilawati,SE"},{"$f":"+INPUT!$E$11","v":"Penata Muda"}]
[270,"X-6",null,null,null,null,null,null,"2013-07-24",2013,"",null,null,null,null,null,null,null,null,null,null,null,null,null,{"$f":"+INPUT!$D$11","v":"Tati Susilawati,SE"},{"$f":"+INPUT!$E$11","v":"Penata Muda"}]
[null,null,null,null,null,{"$f":"COUNTIF(F290:F334,\"L\")","v":1},"Laki-laki",null,"14 Th",{"$f":"+K335/$F$52*100%","v":0},{"$f":"COUNTIF(K290:K334,\"14\")","v":0},null,"BURUH HARIAN",{"$f":"COUNTIF(N290:N334,\"BURUH HARIAN\")","v":0},null,null,null,null,null,"SMP",{"$f":"COUNTIF(U290:U334,\"SMP\")","v":0},"Islam",{"$f":"COUNTIF(W290:W334,\"Islam\")","v":0}]
[null,null,null,null,null,{"$f":"COUNTIF(F290:F334,\"P\")","v":0},"Perempuan",null,"15 Th",{"$f":"+K336/$F$52*100%","v":1},{"$f":"COUNTIF(K290:K334,\"15\")","v":1},null,"PEG / KARY. SWASTA",{"$f":"COUNTIF(N290:N334,\"PEG.SWASTA\")","v":0},null,null,null,null,null,"MTs",{"$f":"COUNTIF(U290:U334,\"MTs\")","v":0},"Katolik",{"$f":"COUNTIF(W290:W334,\"Katolik\")","v":0}]
[null,null,null,null,null,{"$f":"SUM(F335:F336)","v":1},"Total Siswa",null,"16 Th",{"$f":"+K337/$F$52*100%","v":0},{"$f":"COUNTIF(K290:K334,\"16\")","v":0},null,"PNS",{"$f":"COUNTIF(N290:N334,\"PNS\")","v":0},null,null,null,null,null,"Lainnya",{"$f":"+U335+U336","v":0},"Protestan",{"$f":"COUNTIF(W290:W334,\"Protestan\")","v":0}]
[null,null,null,null,null,null,null,null,"17 Th",0,{"$f":"COUNTIF(K290:K334,\"17\")","v":0},null,"WIRASWASTA",{"$f":"COUNTIF(N290:N334,\"WIRASWASTA\")","v":0},null,null,null,null,null,null,null,"Hindu",{"$f":"COUNTIF(W290:W334,\"Hindu\")","v":0}]
[null,null,null,null,null,null,null,null,"18 Th",0,{"$f":"COUNTIF(K290:K334,\"18\")","v":0},null,"KARY/ PEGAWAI .BUMN",{"$f":"COUNTIF(N290:N334,\"PEG/KARY. BUMN\")","v":0},null,null,null,null,null,null,null,"Budha",{"$f":"COUNTIF(W290:W334,\"Budha\")","v":0}]
[null,null,null,null,null,null,null,null,"19 Th",0,{"$f":"COUNTIF(K290:K334,\"13\")","v":0},null,"KEPOLISIAN",{"$f":"COUNTIF(N290:N334,\"KEPOLISIAN\")","v":0},null,null,null,null,null,null,null,null,{"$f":"SUM(W335:W339)","v":0}]
[null,null,null,null,null,null,null,null,"20 Th",0,{"$f":"COUNTIF(K290:K334,\"19\")","v":0},null,"PENSIUNAN",{"$f":"COUNTIF(N290:N334,\"PENSIUNAN\")","v":0}]
[null,null,null,null,null,null,null,null,"TOTAL",1,{"$f":"SUM(K335:K341)","v":1},null,"HONORER",{"$f":"COUNTIF(N290:N334,\"HONORER\")","v":0}]
[null,null,null,null,null,null,null,null,null,null,null,null,"GURU",{"$f":"COUNTIF(N290:N334,\"GURU\")","v":0}]
[null,null,null,null,null,null,null,null,null,null,null,null,"TAK ADA DATA",{"$f":"COUNTIF(N290:N334,\"TAK ADA DATA\")","v":0}]
[null,null,null,null,null,null,null,null,null,null,null,null,"TOTAL DATA",{"$f":"SUM(N335:N344)","v":0}]
[null,{"$f":"MAX(A290:A334)","v":270}]
[]
[]
[null,null,"Data Kosong",{"$f":"COUNTBLANK(D5:D347)","v":337},{"$f":"COUNTBLANK(E5:E347)","v":337},{"$f":"+F50+F107+F164+F221+F278+F335","v":4},"L",null,"14 Th",{"$f":"+K349/$F$351*100%","v":0.5},{"$f":"+K50+K107+K164+K221+K278+K335","v":3},null,null,null,null,{"$f":"COUNTBLANK(P3:P231)","v":228},{"$f":"COUNTBLANK(Q3:Q231)","v":228},{"$f":"COUNTBLANK(R3:R231)","v":228},null,"SMPN-L",{"$f":"COUNTIF(U5:U347,\"SMPN-L\")","v":0},{"$f":"+U349+U350","v":0},{"$f":"COUNTIF(W3:W347,\"Islam\")","v":1}]
[{"$f":"COUNTA(A5:A334)-1&\"  Siswa\"","v":"269  Siswa"},null,"Data Terisi",{"$f":"COUNTA(D5:D347)","v":6},{"$f":"COUNTA(E5:E347)","v":6},{"$f":"+F51+F108+F165+F222+F279+F336","v":2},"P",null,"15 Th",0.5,3,null,{"$f":"COUNTBLANK(M3:M231)","v":195},null,null,"Ijazah lagi",null,"SKHUN lagi",null,"SMP-L",{"$f":"COUNTIF(U5:U347,\"SMP-L\")","v":0},null,{"$f":"COUNTIF(W3:W347,\"Kristen Katolik\")","v":0}]
[null,"KELAS","PENDAPATAN ORANG TUA","AGAMA",null,{"$f":"SUM(F349:F350)","v":6},"Laki-laki & Perempuan",null,"16 Th",0,0,null,"BURUH HARIAN",{"$f":"COUNTIF(N5:N346,\"BURUH HARIAN\")","v":0},{"$f":"+N351/$F$351*100%","v":0},null,null,null,null,"SMPN-P",{"$f":"COUNTIF(U5:U347,\"SMPN-P\")","v":0},{"$f":"+U351+U352","v":0},{"$f":"COUNTIF(W3:W347,\"Kristen Protestan\")","v":0}]
[null,"X-1","Rp 1,500,000","Islam",null,null,null,null,"17 Th",0,0,null,"PEG / KARY. SWASTA",{"$f":"COUNTIF(N5:N346,\"PEG.SWASTA\")","v":0},{"$f":"+N352/$F$351*100%","v":0},null,null,null,null,"SMP-P",{"$f":"COUNTIF(U5:U347,\"SMP-P\")","v":0},null,{"$f":"COUNTIF(W3:W347,\"Hindu\")","v":0}]
[null,"X-2","Rp 1,500,000 s.d 2,500,000","Katolik",null,null,"LULUSAN",null,"18 Th",0,0,null,"PNS",{"$f":"COUNTIF(N5:N346,\"PNS\")","v":0},0,null,null,null,null,"MTs-L",{"$f":"COUNTIF(U5:U347,\"MTSN-L\")","v":0},{"$f":"+U353+U354","v":0},{"$f":"COUNTIF(W3:W347,\"Budha\")","v":0}]
[null,"X-3","Rp 2.500,000 s.d 4,000,000","Protestan",null,null,"SMP",null,"19 Th",0,0,null,"WIRASWASTA",{"$f":"COUNTIF(N5:N346,\"WIRASWASTA\")","v":0},0,null,null,null,null,"MTSN-L",{"$f":"COUNTIF(U5:U347,\"MTS-L\")","v":0},null,{"$f":"SUM(W349:W353)","v":1}]
[null,"X-4","Rp 4,000,000 s.d 6,000,000","Hindu",null,null,"MTS",null,"20 Th",0,0,null,"KARY/ PEGAWAI .BUMN",{"$f":"COUNTIF(N5:N346,\"PEG/KARY. BUMN\")","v":0},0,null,null,null,null,"MTs-P",{"$f":"COUNTIF(U5:U347,\"MTSN-P\")","v":0},{"$f":"+U355+U356","v":0}]
[null,"X-5","Lebih dari Rp.6,000,000","Budha",null,null,"Lainnya",null,"TOTAL",{"$f":"SUM(J349:J355)","v":1},{"$f":"SUM(K349:K355)","v":6},null,"KEPOLISIAN",{"$f":"COUNTIF(N5:N346,\"KEPOLISIAN\")","v":0},0,null,null,null,null,"MTSN-P",{"$f":"COUNTIF(U5:U347,\"MTS-P\")","v":0}]
[null,"X-6","ASAL SEKOLAH",null,null,null,null,null,null,null,null,null,"PENSIUNAN",{"$f":"COUNTIF(N5:N346,\"PENSIUNAN\")","v":0},0,null,null,null,null,null,{"$f":"SUM(U349:U356)","v":0}]
[null,"XI-IPA 1","SMPN 1 CILEGON",null,null,null,null,null,null,null,null,null,"HONORER",{"$f":"COUNTIF(N5:N346,\"HONORER\")","v":0},0]
[null,"XI-IPA 2","SMPN 2 CILEGON",null,null,null,null,null,null,null,null,null,"GURU",{"$f":"COUNTIF(N5:N346,\"GURU\")","v":0},0]
[null,"XI-IPA 3","SMPN 3 CILEGON",null,null,null,null,null,null,null,null,null,"TAK ADA DATA",{"$f":"COUNTIF(N5:N346,\"TAK ADA DATA\")","v":0},0]
[null,"XI-IPS 1","SMPN 4 CILEGON"]
[null,"XI-IPS 2","SMPN 5 CILEGON",null,null,null,null,null,null,null,null,null,"TOTAL DATA",{"$f":"SUM(N351:N361)&\" Orang\"","v":"0 Orang"},{"$f":"SUM(O351:O360)","v":0}]
[null,"XI-IPS 3","SMPN 6 CILEGON"]
[null,"XII-IPA 1","SMPN 7 CILEGON"]
[null,"XII-IPA 2","SMPN 8 CILEGON"]
[null,"XII-IPA 3","SMPN 9 CILEGON"]
[null,"XII-IPS 1","SMPN 10 CILEGON"]
[null,"XII-IPS 2","SMPN 11 CILEGON"]
[null,"XII-IPS 3","SMP MADINATUL HADIED"]
[null,null,"SMP MUHAMMADIYAH CILEGON"]
[null,null,"SMP PGRI 2 CILEGON"]
[null,null,"SMP AL-ISHLAH"]
[null,null,"SMP YP FATAHILAH"]
[null,null,"SMP YP 17 CILEGON"]
[null,null,"SMP MAFLAHUL UMMAH"]
[null,null,"SMP TUNAS BANGSA CILEGON"]
[null,null,"SMPIT R-JANNAH"]
[null,null,"SMP YPWKS"]
[null,null,"MTSN CILEGON"]
[null,null,"MTSN CIWANDAN"]
[null,null,"MTS ALKH-KRACAK"]
[null,null,"MTS AL-ITMAM"]
[null,null,"MTS AL-INAYAH"]
[null,null,"MTS AL-KHAIRIYAH DELINSENG"]
[null,null,"MTS AL-KHAIRIYAH PEKALONGAN"]
[null,null,"MTS AL-KHAIRIYAH KUBANGSARI"]
[null,null,"MTS AL-KHAIRIYAH PENAUHAN"]
[null,null,"MTS AL-BUSTANIYAH"]
[null,null,"MTS AL-IANAH JANGKAR"]
[null,null,"MTS AL-KH-KARANG JETAK"]
[null,null,"MTS YP HIKMATUL ULUM"]
[null,null,"MTS AL-KHAIRIYAH CITANGKIL"]
[null,null,"MTS AL-MUMTAZ MERAK"]
[null,null,"MTS BANINAWAWY"]
[null,null,"MTS AL-HIDAYAH"]
[null,null,"MTS AL-KH TGL BUNTU"]
[null,null,"MTS ARDANIAH SERANG"]
[null,null,"SMPN 1 MANCAK"]
[null,null,"SMPN 2 MANCAK"]
[null,null,"SMPN 1 KRAMATWATU"]
[null,null,"SMPN 1 ANYAR"]
[null,null,"SMPN 3 MANCAK"]
[null,null,"SMPN 3 KRAMATWATU"]
[null,null,"SMPIT DARUSSALAM PIPITAN"]
[null,null,"SMPN 1 ATAP 2 TUNGKAL ULU"]
[null,null,"SMPN 3 TANGERANG"]
[null,null,"MTsN ANYAR"]
[null,null,"MTS DAAR EL QOLAM"]
[null,null,"SMPN METRO"]
[null,null,"SMP 15 B.LAMPUNG"]
[null,null,"MTSN CILEGON"]
[null,null,"MTSN CIWANDAN"]
[null,null,"LAINNYA"]
[null,null,null,null,null,null,null,null,null,null,null,"Wanita 13",{"$f":"SUMPRODUCT(($F$5:$F$334=\"P\")*($K$5:$K$334=13))","v":0}]
[null,null,null,null,null,null,null,null,null,null,null,"Pria 13",{"$f":"SUMPRODUCT(($F$5:$F$334=\"L\")*($K$5:$K$334=13))","v":0}]
[null,null,null,null,null,null,null,null,null,null,null,"Wanita 14",{"$f":"SUMPRODUCT(($F$5:$F$334=\"P\")*($K$5:$K$334=14))","v":2}]
[null,null,null,null,null,null,null,null,null,null,null,"Pria 14",{"$f":"SUMPRODUCT(($F$5:$F$334=\"L\")*($K$5:$K$334=14))","v":1}]
[null,null,null,null,null,null,null,null,null,null,null,"Wanita 15",{"$f":"SUMPRODUCT(($F$5:$F$334=\"P\")*($K$5:$K$334=15))","v":0}]
[null,null,null,null,null,null,null,null,null,null,null,"Pria 15",{"$f":"SUMPRODUCT(($F$5:$F$334=\"L\")*($K$5:$K$334=15))","v":3}]
[null,null,null,null,null,null,null,null,null,null,null,"Wanita 16",{"$f":"SUMPRODUCT(($F$5:$F$334=\"P\")*($K$5:$K$334=16))","v":0}]
[null,null,null,null,null,null,null,null,null,null,null,"Pria 16",{"$f":"SUMPRODUCT(($F$5:$F$334=\"L\")*($K$5:$K$334=16))","v":0}]
[null,null,null,null,null,null,null,null,null,null,null,"Wanita 17",{"$f":"SUMPRODUCT(($F$5:$F$334=\"P\")*($K$5:$K$334=17))","v":0}]
[null,null,null,null,null,null,null,null,null,null,null,"Pria 17",{"$f":"SUMPRODUCT(($F$5:$F$334=\"L\")*($K$5:$K$334=17))","v":0}]
[null,null,null,null,null,null,null,null,null,null,null,"Wanita 18",{"$f":"SUMPRODUCT(($F$5:$F$334=\"P\")*($K$5:$K$334=18))","v":0}]
[null,null,null,null,null,null,null,null,null,null,null,"Pria 18",{"$f":"SUMPRODUCT(($F$5:$F$334=\"L\")*($K$5:$K$334=18))","v":0}]
[null,null,null,null,null,null,null,null,null,null,null,"Wanita 19",{"$f":"SUMPRODUCT(($F$5:$F$334=\"P\")*($K$5:$K$334=19))","v":0}]
[null,null,null,null,null,null,null,null,null,null,null,"Pria 19",{"$f":"SUMPRODUCT(($F$5:$F$334=\"L\")*($K$5:$K$334=19))","v":0}]
[null,null,null,null,null,null,null,null,null,null,null,"Wanita 20",{"$f":"SUMPRODUCT(($F$5:$F$334=\"P\")*($K$5:$K$334=20))","v":0}]
[null,null,null,null,null,null,null,null,null,null,null,"Pria 20",{"$f":"SUMPRODUCT(($F$5:$F$334=\"L\")*($K$5:$K$334=20))","v":0}]
[null,null,null,null,null,null,null,null,null,null,null,"Wanita 21",{"$f":"SUMPRODUCT(($F$5:$F$334=\"P\")*($K$5:$K$334=21))","v":0}]
[null,null,null,null,null,null,null,null,null,null,null,"Pria 21",{"$f":"SUMPRODUCT(($F$5:$F$334=\"L\")*($K$5:$K$334=21))","v":0}]
[null,null,null,null,null,null,null,null,null,null,null,"Wanita 22",{"$f":"SUMPRODUCT(($F$5:$F$334=\"P\")*($K$5:$K$334=22))","v":0}]
[null,null,null,null,null,null,null,null,null,null,null,"Pria 22",{"$f":"SUMPRODUCT(($F$5:$F$334=\"L\")*($K$5:$K$334=22))","v":0}]
[null,null,null,null,null,null,null,null,null,null,null,"Wanita 23",{"$f":"SUMPRODUCT(($F$5:$F$334=\"P\")*($K$5:$K$334=23))","v":0}]
[null,null,null,null,null,null,null,null,null,null,null,"Pria 23",{"$f":"SUMPRODUCT(($F$5:$F$334=\"L\")*($K$5:$K$334=23))","v":0}]
[null,null,null,null,null,null,null,null,null,null,null,"Wanita 24",{"$f":"SUMPRODUCT(($F$5:$F$334=\"P\")*($K$5:$K$334=24))","v":0}]
[null,null,null,null,null,null,null,null,null,null,null,"Pria 24",{"$f":"SUMPRODUCT(($F$5:$F$334=\"L\")*($K$5:$K$334=24))","v":0}]
[null,null,null,null,null,null,null,null,null,null,null,"Wanita 25",{"$f":"SUMPRODUCT(($F$5:$F$334=\"P\")*($K$5:$K$334=25))","v":0}]
[null,null,null,null,null,null,null,null,null,null,null,"Pria 25",{"$f":"SUMPRODUCT(($F$5:$F$334=\"L\")*($K$5:$K$334=25))","v":0}]
[null,null,null,null,null,null,null,null,null,null,null,null,{"$f":"SUM(M414:M439)&\"  Siswa \"","v":"6  Siswa "}]

{"sheet":"DataBase-XI","index":4,"n_rows":440,"n_cols":30,"rows_kept":440,"cut":false,"hidden":false,"merged":[[439,12,440,12],[352,21,353,21],[354,21,355,21],[0,8,0,9],[0,26,0,28],[346,0,346,22],[347,0,347,22],[348,21,349,21],[350,21,351,21]]}
["NO","KELAS","NAMA","NIS","NISN","L/P","TMPT LHR","TGL LAHIR","Val",null,"Usia ","NAMA ORANG TUA","PENDAPATAN ORANG TUA","PEKERJAAN ORANG TUA","ALAMAT","NO STTB","NO SKHU","NO PESERTA UJIAN SMP","ASAL SEKOLAH","THN LULUS","SMP/ MTs","NO TELP/HP",null,"NAMA IBU","WALI KELAS","JABATAN","DATA SISWA MUTASI"]
[1,2,3,4,5,6,7,8,9,10,11,12,13,14,15,16,17,18,19,20,21,22,23,24,25,26,"Tanggal Bulan dan Tahun","Kelas dan Semester yang ditinggalkan","Alasan Keluar dan atas permintaan (Tertulis)",27]
["Contoh>>","X-1","AAM TAMIMI",12130001,"9970454991","L","CILEGON","1997-05-04",1997,{"$f":"+MENU!$D$6","v":2013},{"$f":"+J3-I3","v":16},"AHYADI","Rp 500 - 700 Ribu","BURUH HARIAN","Jl.Sunan Drajat Link.Cirahap RT 17/02 Ciwandan Cilegon 42444","DN-30 DI 0028823","DN-30 DI 2803800","2-12-30-03-005-139-6","SMPN 4 CILEGON",2012,"SMP","087773100391","Islam",null,null,null,"31/01/2012","X-1 Semester 1","Permintaan Orang Tua "]
["No Urut","PILIH Kls",null,null,null,null,null,null,null,null,null,null,null,null,null,null,null,null,null,null,null,null,null,null,null,null,"2013-01-23","XI-IPA 1 Semester 1","Permintaan Orang Tua "]
[1,{"$f":"+INPUT!$H$6","v":"XI IPA-1"},"AL HEELAL IDHANA",12130073,9907455968,"L","BREBES","1997-02-19",{"$f":"TODAY()","v":"2013-07-24"},{"$f":"+$J$3","v":2013},{"$f":"IF(H5=\"\",\"\",DATEDIF(H5,I5,\"y\"))","v":16},null,"Rp:3,500,000 Keatas",null,null,null,null,null,null,2012,"MTs",null,"Islam",null,{"$f":"+INPUT!$I$6","v":"Nismawati,S.Si"},{"$f":"+INPUT!$J$6","v":"Penata Muda"},null,null,null,{"$f":"+B5","v":"XI IPA-1"}]
[2,{"$f":"IF(A6=0,\" \",+B5)","v":"XI IPA-1"},null,null,null,null,null,null,{"$f":"TODAY()","v":"2013-07-24"},2013,{"$f":"IF(H6=\"\",\"\",DATEDIF(H6,I6,\"y\"))","v":""},null,null,null,null,null,null,null,null,null,null,null,null,null,{"$f":"+INPUT!$I$6","v":"Nismawati,S.Si"},{"$f":"+INPUT!$J$6","v":"Penata Muda"}]
[3,{"$f":"IF(A7=0,\" \",+B6)","v":"XI IPA-1"},null,null,null,null,null,null,"2013-07-24",2013,"",null,null,null,null,null,null,null,null,null,null,null,null,null,{"$f":"+INPUT!$I$6","v":"Nismawati,S.Si"},{"$f":"+INPUT!$J$6","v":"Penata Muda"}]
[4,"XI IPA-1",null,null,null,null,null,null,"2013-07-24",2013,"",null,null,null,null,null,null,null,null,null,null,null,null,null,{"$f":"+INPUT!$I$6","v":"Nismawati,S.Si"},{"$f":"+INPUT!$J$6","v":"Penata Muda"}]
[5,"XI IPA-1",null,null,null,null,null,null,"2013-07-24",2013,"",null,null,null,null,null,null,null,null,null,null,null,null,null,{"$f":"+INPUT!$I$6","v":"Nismawati,S.Si"},{"$f":"+INPUT!$J$6","v":"Penata Muda"}]
[6,"XI IPA-1",null,null,null,null,null,null,"2013-07-24",2013,"",null,null,null,null,null,null,null,null,null,null,null,null,null,{"$f":"+INPUT!$I$6","v":"Nismawati,S.Si"},{"$f":"+INPUT!$J$6","v":"Penata Muda"}]
[7,"XI IPA-1",null,null,null,null,null,null,"2013-07-24",2013,"",null,null,null,null,null,null,null,null,null,null,null,null,null,{"$f":"+INPUT!$I$6","v":"Nismawati,S.Si"},{"$f":"+INPUT!$J$6","v":"Penata Muda"}]
[8,"XI IPA-1",null,null,null,null,null,null,"2013-07-24",2013,"",null,null,null,null,null,null,null,null,null,null,null,null,null,{"$f":"+INPUT!$I$6","v":"Nismawati,S.Si"},{"$f":"+INPUT!$J$6","v":"Penata Muda"}]
[9,"XI IPA-1",null,null,null,null,null,null,"2013-07-24",2013,"",null,null,null,null,null,null,null,null,null,null,null,null,null,{"$f":"+INPUT!$I$6","v":"Nismawati,S.Si"},{"$f":"+INPUT!$J$6","v":"Penata Muda"}]
[10,"XI IPA-1",null,null,null,null,null,null,"2013-07-24",2013,"",null,null,null,null,null,null,null,null,null,null,null,null,null,{"$f":"+INPUT!$I$6","v":"Nismawati,S.Si"},{"$f":"+INPUT!$J$6","v":"Penata Muda"}]
[11,"XI IPA-1",null,null,null,null,null,null,"2013-07-24",2013,"",null,null,null,null,null,null,null,null,null,null,null,null,null,{"$f":"+INPUT!$I$6","v":"Nismawati,S.Si"},{"$f":"+INPUT!$J$6","v":"Penata Muda"}]
[12,"XI IPA-1",null,null,null,null,null,null,"2013-07-24",2013,"",null,null,null,null,null,null,null,null,null,null,null,null,null,{"$f":"+INPUT!$I$6","v":"Nismawati,S.Si"},{"$f":"+INPUT!$J$6","v":"Penata Muda"}]
[13,"XI IPA-1",null,null,null,null,null,null,"2013-07-24",2013,"",null,null,null,null,null,null,null,null,null,null,null,null,null,{"$f":"+INPUT!$I$6","v":"Nismawati,S.Si"},{"$f":"+INPUT!$J$6","v":"Penata Muda"}]
[14,"XI IPA-1",null,null,null,null,null,null,"2013-07-24",2013,"",null,null,null,null,null,null,null,null,null,null,null,null,null,{"$f":"+INPUT!$I$6","v":"Nismawati,S.Si"},{"$f":"+INPUT!$J$6","v":"Penata Muda"}]
[15,"XI IPA-1",null,null,null,null,null,null,"2013-07-24",2013,"",null,null,null,null,null,null,null,null,null,null,null,null,null,{"$f":"+INPUT!$I$6","v":"Nismawati,S.Si"},{"$f":"+INPUT!$J$6","v":"Penata Muda"}]
[16,"XI IPA-1",null,null,null,null,null,null,"2013-07-24",2013,"",null,null,null,null,null,null,null,null,null,null,null,null,null,{"$f":"+INPUT!$I$6","v":"Nismawati,S.Si"},{"$f":"+INPUT!$J$6","v":"Penata Muda"}]
[17,"XI IPA-1",null,null,null,null,null,null,"2013-07-24",2013,"",null,null,null,null,null,null,null,null,null,null,null,null,null,{"$f":"+INPUT!$I$6","v":"Nismawati,S.Si"},{"$f":"+INPUT!$J$6","v":"Penata Muda"}]
[18,"XI IPA-1",null,null,null,null,null,null,"2013-07-24",2013,"",null,null,null,null,null,null,null,null,null,null,null,null,null,{"$f":"+INPUT!$I$6","v":"Nismawati,S.Si"},{"$f":"+INPUT!$J$6","v":"Penata Muda"}]
[19,"XI IPA-1",null,null,null,null,null,null,"2013-07-24",2013,"",null,null,null,null,null,null,null,null,null,null,null,null,null,{"$f":"+INPUT!$I$6","v":"Nismawati,S.Si"},{"$f":"+INPUT!$J$6","v":"Penata Muda"}]
[20,"XI IPA-1",null,null,null,null,null,null,"2013-07-24",2013,"",null,null,null,null,null,null,null,null,null,null,null,null,null,{"$f":"+INPUT!$I$6","v":"Nismawati,S.Si"},{"$f":"+INPUT!$J$6","v":"Penata Muda"}]
[21,"XI IPA-1",null,null,null,null,null,null,"2013-07-24",2013,"",null,null,null,null,null,null,null,null,null,null,null,null,null,{"$f":"+INPUT!$I$6","v":"Nismawati,S.Si"},{"$f":"+INPUT!$J$6","v":"Penata Muda"}]
[22,"XI IPA-1",null,null,null,null,null,null,"2013-07-24",2013,"",null,null,null,null,null,null,null,null,null,null,null,null,null,{"$f":"+INPUT!$I$6","v":"Nismawati,S.Si"},{"$f":"+INPUT!$J$6","v":"Penata Muda"}]
[23,"XI IPA-1",null,null,null,null,null,null,"2013-07-24",2013,"",null,null,null,null,null,null,null,null,null,null,null,null,null,{"$f":"+INPUT!$I$6","v":"Nismawati,S.Si"},{"$f":"+INPUT!$J$6","v":"Penata Muda"}]
[24,"XI IPA-1",null,null,null,null,null,null,"2013-07-24",2013,"",null,null,null,null,null,null,null,null,null,null,null,null,null,{"$f":"+INPUT!$I$6","v":"Nismawati,S.Si"},{"$f":"+INPUT!$J$6","v":"Penata Muda"}]
[25,"XI IPA-1",null,null,null,null,null,null,"2013-07-24",2013,"",null,null,null,null,null,null,null,null,null,null,null,null,null,{"$f":"+INPUT!$I$6","v":"Nismawati,S.Si"},{"$f":"+INPUT!$J$6","v":"Penata Muda"}]
[26,"XI IPA-1",null,null,null,null,null,null,"2013-07-24",2013,"",null,null,null,null,null,null,null,null,null,null,null,null,null,{"$f":"+INPUT!$I$6","v":"Nismawati,S.Si"},{"$f":"+INPUT!$J$6","v":"Penata Muda"}]
[27,"XI IPA-1",null,null,null,null,null,null,"2013-07-24",2013,"",null,null,null,null,null,null,null,null,null,null,null,null,null,{"$f":"+INPUT!$I$6","v":"Nismawati,S.Si"},{"$f":"+INPUT!$J$6","v":"Penata Muda"}]
[28,"XI IPA-1",null,null,null,null,null,null,"2013-07-24",2013,"",null,null,null,null,null,null,null,null,null,null,null,null,null,{"$f":"+INPUT!$I$6","v":"Nismawati,S.Si"},{"$f":"+INPUT!$J$6","v":"Penata Muda"}]
[29,"XI IPA-1",null,null,null,null,null,null,"2013-07-24",2013,"",null,null,null,null,null,null,null,null,null,null,null,null,null,{"$f":"+INPUT!$I$6","v":"Nismawati,S.Si"},{"$f":"+INPUT!$J$6","v":"Penata Muda"}]
[30,"XI IPA-1",null,null,null,null,null,null,"2013-07-24",2013,"",null,null,null,null,null,null,null,null,null,null,null,null,null,{"$f":"+INPUT!$I$6","v":"Nismawati,S.Si"},{"$f":"+INPUT!$J$6","v":"Penata Muda"}]
[31,"XI IPA-1",null,null,null,null,null,null,"2013-07-24",2013,"",null,null,null,null,null,null,null,null,null,null,null,null,null,{"$f":"+INPUT!$I$6","v":"Nismawati,S.Si"},{"$f":"+INPUT!$J$6","v":"Penata Muda"}]
[32,"XI IPA-1",null,null,null,null,null,null,"2013-07-24",2013,"",null,null,null,null,null,null,null,null,null,null,null,null,null,{"$f":"+INPUT!$I$6","v":"Nismawati,S.Si"},{"$f":"+INPUT!$J$6","v":"Penata Muda"}]
[33,"XI IPA-1",null,null,null,null,null,null,"2013-07-24",2013,"",null,null,null,null,null,null,null,null,null,null,null,null,null,{"$f":"+INPUT!$I$6","v":"Nismawati,S.Si"},{"$f":"+INPUT!$J$6","v":"Penata Muda"}]
[34,"XI IPA-1",null,null,null,null,null,null,"2013-07-24",2013,"",null,null,null,null,null,null,null,null,null,null,null,null,null,{"$f":"+INPUT!$I$6","v":"Nismawati,S.Si"},{"$f":"+INPUT!$J$6","v":"Penata Muda"}]
[35,"XI IPA-1",null,null,null,null,null,null,"2013-07-24",2013,"",null,null,null,null,null,null,null,null,null,null,null,null,null,{"$f":"+INPUT!$I$6","v":"Nismawati,S.Si"},{"$f":"+INPUT!$J$6","v":"Penata Muda"}]
[36,"XI IPA-1",null,null,null,null,null,null,"2013-07-24",2013,"",null,null,null,null,null,null,null,null,null,null,null,null,null,{"$f":"+INPUT!$I$6","v":"Nismawati,S.Si"},{"$f":"+INPUT!$J$6","v":"Penata Muda"}]
[37,"XI IPA-1",null,null,null,null,null,null,"2013-07-24",2013,"",null,null,null,null,null,null,null,null,null,null,null,null,null,{"$f":"+INPUT!$I$6","v":"Nismawati,S.Si"},{"$f":"+INPUT!$J$6","v":"Penata Muda"}]
[38,"XI IPA-1",null,null,null,null,null,null,{"$f":"TODAY()","v":"2013-07-24"},2013,"",null,null,null,null,null,null,null,null,null,null,null,null,null,{"$f":"+INPUT!$I$6","v":"Nismawati,S.Si"},{"$f":"+INPUT!$J$6","v":"Penata Muda"}]
[39,"XI IPA-1",null,null,null,null,null,null,"2013-07-24",2013,"",null,null,null,null,null,null,null,null,null,null,null,null,null,{"$f":"+INPUT!$I$6","v":"Nismawati,S.Si"},{"$f":"+INPUT!$J$6","v":"Penata Muda"}]
[40,"XI IPA-1",null,null,null,null,null,null,"2013-07-24",2013,"",null,null,null,null,null,null,null,null,null,null,null,null,null,{"$f":"+INPUT!$I$6","v":"Nismawati,S.Si"},{"$f":"+INPUT!$J$6","v":"Penata Muda"}]
[41,"XI IPA-1",null,null,null,null,null,null,"2013-07-24",2013,"",null,null,null,null,null,null,null,null,null,null,null,null,null,{"$f":"+INPUT!$I$6","v":"Nismawati,S.Si"},{"$f":"+INPUT!$J$6","v":"Penata Muda"}]
[42,"XI IPA-1",null,null,null,null,null,null,"2013-07-24",2013,"",null,null,null,null,null,null,null,null,null,null,null,null,null,{"$f":"+INPUT!$I$6","v":"Nismawati,S.Si"},{"$f":"+INPUT!$J$6","v":"Penata Muda"}]
[43,"XI IPA-1",null,null,null,null,null,null,"2013-07-24",2013,"",null,null,null,null,null,null,null,null,null,null,null,null,null,{"$f":"+INPUT!$I$6","v":"Nismawati,S.Si"},{"$f":"+INPUT!$J$6","v":"Penata Muda"}]
[44,"XI IPA-1",null,null,null,null,null,null,"2013-07-24",2013,"",null,null,null,null,null,null,null,null,null,null,null,null,null,{"$f":"+INPUT!$I$6","v":"Nismawati,S.Si"},{"$f":"+INPUT!$J$6","v":"Penata Muda"}]
[45,"XI IPA-1",null,null,null,null,null,null,"2013-07-24",2013,"",null,null,null,null,null,null,null,null,null,null,null,null,null,{"$f":"+INPUT!$I$6","v":"Nismawati,S.Si"},{"$f":"+INPUT!$J$6","v":"Penata Muda"}]
[null,null,null,null,null,{"$f":"COUNTIF(F5:F49,\"L\")","v":1},"Laki-laki",null,"14 Th",{"$f":"+K50/$F$52*100%","v":0},{"$f":"COUNTIF(K5:K49,\"14\")","v":0},null,"BURUH HARIAN",0,null,null,null,null,null,"SMP",{"$f":"COUNTIF(U5:U49,\"SMP\")","v":0},"Islam",{"$f":"COUNTIF(W5:W49,\"Islam\")","v":1},null,null,{"$f":"+INPUT!$J$6","v":"Penata Muda"}]
[null,null,null,null,null,{"$f":"COUNTIF(F5:F49,\"P\")","v":0},"Perempuan",null,"15 Th",{"$f":"+K51/$F$52*100%","v":0},{"$f":"COUNTIF(K5:K49,\"15\")","v":0},null,"PEG / KARY. SWASTA",0,null,null,null,null,null,"MTs",{"$f":"COUNTIF(U5:U49,\"MTs\")","v":1},"Katolik",{"$f":"COUNTIF(W5:W49,\"Katolik\")","v":0},null,null,{"$f":"+INPUT!$J$6","v":"Penata Muda"}]
[null,null,null,null,null,{"$f":"+F50+F51","v":1},"Total Siswa",null,"16 Th",{"$f":"+K52/$F$52*100%","v":1},{"$f":"COUNTIF(K5:K49,\"16\")","v":1},null,"PNS",0,null,null,null,null,null,"Lainnya",{"$f":"+U50+U51","v":1},"Protestan",{"$f":"COUNTIF(W5:W49,\"Protestan\")","v":0},null,null,{"$f":"+INPUT!$J$6","v":"Penata Muda"}]
[null,null,null,null,null,null,null,null,"17 Th",0,{"$f":"COUNTIF(K5:K49,\"17\")","v":0},null,"WIRASWASTA",0,null,null,null,null,null,null,null,"Hindu",{"$f":"COUNTIF(W5:W49,\"Hindu\")","v":0},null,null,{"$f":"+INPUT!$J$6","v":"Penata Muda"}]
[null,null,null,null,null,null,null,null,"18 Th",0,{"$f":"COUNTIF(K5:K49,\"18\")","v":0},null,"KARY/ PEGAWAI .BUMN",0,null,null,null,null,null,null,null,"Budha",{"$f":"COUNTIF(W5:W49,\"Budha\")","v":0},null,null,{"$f":"+INPUT!$J$6","v":"Penata Muda"}]
[null,null,null,null,null,null,null,null,"19 Th",0,{"$f":"COUNTIF(K5:K49,\"19\")","v":0},null,"KEPOLISIAN",0,null,null,null,null,null,null,null,null,{"$f":"SUM(W50:W54)","v":1},null,null,{"$f":"+INPUT!$J$6","v":"Penata Muda"}]
[null,null,null,null,null,null,null,null,"20 Th",0,{"$f":"COUNTIF(K5:K49,\"20\")","v":0},null,"PENSIUNAN",0,null,null,null,null,null,null,null,null,null,null,null,{"$f":"+INPUT!$J$6","v":"Penata Muda"}]
[null,null,null,null,null,null,null,null,"TOTAL",1,{"$f":"SUM(K50:K56)","v":1},null,"HONORER",0,null,null,null,null,null,null,null,null,null,null,null,{"$f":"+INPUT!$J$6","v":"Penata Muda"}]
[null,null,null,null,null,null,null,null,null,null,null,null,"GURU",0,null,null,null,null,null,null,null,null,null,null,null,{"$f":"+INPUT!$J$6","v":"Penata Muda"}]
[null,null,null,null,null,null,null,null,null,null,null,null,"TAK ADA DATA",0,null,null,null,null,null,null,null,null,null,null,null,{"$f":"+INPUT!$J$6","v":"Penata Muda"}]
[null,null,null,null,null,null,null,null,null,null,null,null,"TOTAL DATA",0,null,null,null,null,null,null,null,null,null,null,null,{"$f":"+INPUT!$J$6","v":"Penata Muda"}]
[null,{"$f":"MAX(A5:A49)","v":45},null,null,null,null,null,null,null,null,null,null,null,null,null,null,null,null,null,null,null,null,null,null,null,{"$f":"+INPUT!$J$6","v":"Penata Muda"}]
[{"$f":"+$B$61+1","v":46},{"$f":"+INPUT!$H$7","v":"XI IPA-2"},"AFID HIDAYAT",12130036,"9966354541","L","SERANG","1996-11-15",{"$f":"TODAY()","v":"2013-07-24"},{"$f":"+$J$3","v":2013},{"$f":"IF(H62=\"\",\"\",DATEDIF(H62,I62,\"y\"))","v":16},null,null,null,null,null,null,null,null,null,null,null,null,null,{"$f":"+INPUT!$I$7","v":"Sati fatchani,S.Pd"},{"$f":"+INPUT!$J$7","v":"Penata Muda"},null,null,null,{"$f":"+B62","v":"XI IPA-2"}]
[{"$f":"+A62+1","v":47},{"$f":"IF(A63=0,\" \",+B62)","v":"XI IPA-2"},null,null,null,null,null,null,{"$f":"TODAY()","v":"2013-07-24"},2013,{"$f":"IF(H63=\"\",\"\",DATEDIF(H63,I63,\"y\"))","v":""},null,null,null,null,null,null,null,null,null,null,null,null,null,{"$f":"+INPUT!$I$7","v":"Sati fatchani,S.Pd"},{"$f":"+INPUT!$J$7","v":"Penata Muda"}]
[{"$f":"+A63+1","v":48},{"$f":"IF(A64=0,\" \",+B63)","v":"XI IPA-2"},null,null,null,null,null,null,"2013-07-24",2013,"",null,null,null,null,null,null,null,null,null,null,null,null,null,{"$f":"+INPUT!$I$7","v":"Sati fatchani,S.Pd"},{"$f":"+INPUT!$J$7","v":"Penata Muda"}]
[49,{"$f":"IF(A65=0,\" \",+B64)","v":"XI IPA-2"},null,null,null,null,null,null,"2013-07-24",2013,"",null,null,null,null,null,null,null,null,null,null,null,null,null,{"$f":"+INPUT!$I$7","v":"Sati fatchani,S.Pd"},{"$f":"+INPUT!$J$7","v":"Penata Muda"}]
[50,"XI IPA-2",null,null,null,null,null,null,"2013-07-24",2013,"",null,null,null,null,null,null,null,null,null,null,null,null,null,{"$f":"+INPUT!$I$7","v":"Sati fatchani,S.Pd"},{"$f":"+INPUT!$J$7","v":"Penata Muda"}]
[51,"XI IPA-2",null,null,null,null,null,null,"2013-07-24",2013,"",null,null,null,null,null,null,null,null,null,null,null,null,null,{"$f":"+INPUT!$I$7","v":"Sati fatchani,S.Pd"},{"$f":"+INPUT!$J$7","v":"Penata Muda"}]
[52,"XI IPA-2",null,null,null,null,null,null,"2013-07-24",2013,"",null,null,null,null,null,null,null,null,null,null,null,null,null,{"$f":"+INPUT!$I$7","v":"Sati fatchani,S.Pd"},{"$f":"+INPUT!$J$7","v":"Penata Muda"}]
[53,"XI IPA-2",null,null,null,null,null,null,"2013-07-24",2013,"",null,null,null,null,null,null,null,null,null,null,null,null,null,{"$f":"+INPUT!$I$7","v":"Sati fatchani,S.Pd"},{"$f":"+INPUT!$J$7","v":"Penata Muda"}]
[54,"XI IPA-2",null,null,null,null,null,null,"2013-07-24",2013,"",null,null,null,null,null,null,null,null,null,null,null,null,null,{"$f":"+INPUT!$I$7","v":"Sati fatchani,S.Pd"},{"$f":"+INPUT!$J$7","v":"Penata Muda"}]
[55,"XI IPA-2",null,null,null,null,null,null,"2013-07-24",2013,"",null,null,null,null,null,null,null,null,null,null,null,null,null,{"$f":"+INPUT!$I$7","v":"Sati fatchani,S.Pd"},{"$f":"+INPUT!$J$7","v":"Penata Muda"}]
[56,"XI IPA-2",null,null,null,null,null,null,"2013-07-24",2013,"",null,null,null,null,null,null,null,null,null,null,null,null,null,{"$f":"+INPUT!$I$7","v":"Sati fatchani,S.Pd"},{"$f":"+INPUT!$J$7","v":"Penata Muda"}]
[57,"XI IPA-2",null,null,null,null,null,null,"2013-07-24",2013,"",null,null,null,null,null,null,null,null,null,null,null,null,null,{"$f":"+INPUT!$I$7","v":"Sati fatchani,S.Pd"},{"$f":"+INPUT!$J$7","v":"Penata Muda"}]
[58,"XI IPA-2",null,null,null,null,null,null,"2013-07-24",2013,"",null,null,null,null,null,null,null,null,null,null,null,null,null,{"$f":"+INPUT!$I$7","v":"Sati fatchani,S.Pd"},{"$f":"+INPUT!$J$7","v":"Penata Muda"}]
[59,"XI IPA-2",null,null,null,null,null,null,"2013-07-24",2013,"",null,null,null,null,null,null,null,null,null,null,null,null,null,{"$f":"+INPUT!$I$7","v":"Sati fatchani,S.Pd"},{"$f":"+INPUT!$J$7","v":"Penata Muda"}]
[60,"XI IPA-2",null,null,null,null,null,null,"2013-07-24",2013,"",null,null,null,null,null,null,null,null,null,null,null,null,null,{"$f":"+INPUT!$I$7","v":"Sati fatchani,S.Pd"},{"$f":"+INPUT!$J$7","v":"Penata Muda"}]
[61,"XI IPA-2",null,null,null,null,null,null,"2013-07-24",2013,"",null,null,null,null,null,null,null,null,null,null,null,null,null,{"$f":"+INPUT!$I$7","v":"Sati fatchani,S.Pd"},{"$f":"+INPUT!$J$7","v":"Penata Muda"}]
[62,"XI IPA-2",null,null,null,null,null,null,"2013-07-24",2013,"",null,null,null,null,null,null,null,null,null,null,null,null,null,{"$f":"+INPUT!$I$7","v":"Sati fatchani,S.Pd"},{"$f":"+INPUT!$J$7","v":"Penata Muda"}]
[63,"XI IPA-2",null,null,null,null,null,null,"2013-07-24",2013,"",null,null,null,null,null,null,null,null,null,null,null,null,null,{"$f":"+INPUT!$I$7","v":"Sati fatchani,S.Pd"},{"$f":"+INPUT!$J$7","v":"Penata Muda"}]
[64,"XI IPA-2",null,null,null,null,null,null,"2013-07-24",2013,"",null,null,null,null,null,null,null,null,null,null,null,null,null,{"$f":"+INPUT!$I$7","v":"Sati fatchani,S.Pd"},{"$f":"+INPUT!$J$7","v":"Penata Muda"}]
[65,"XI IPA-2",null,null,null,null,null,null,"2013-07-24",2013,"",null,null,null,null,null,null,null,null,null,null,null,null,null,{"$f":"+INPUT!$I$7","v":"Sati fatchani,S.Pd"},{"$f":"+INPUT!$J$7","v":"Penata Muda"}]
[66,"XI IPA-2",null,null,null,null,null,null,"2013-07-24",2013,"",null,null,null,null,null,null,null,null,null,null,null,null,null,{"$f":"+INPUT!$I$7","v":"Sati fatchani,S.Pd"},{"$f":"+INPUT!$J$7","v":"Penata Muda"}]
[67,"XI IPA-2",null,null,null,null,null,null,"2013-07-24",2013,"",null,null,null,null,null,null,null,null,null,null,null,null,null,{"$f":"+INPUT!$I$7","v":"Sati fatchani,S.Pd"},{"$f":"+INPUT!$J$7","v":"Penata Muda"}]
[68,"XI IPA-2",null,null,null,null,null,null,"2013-07-24",2013,"",null,null,null,null,null,null,null,null,null,null,null,null,null,{"$f":"+INPUT!$I$7","v":"Sati fatchani,S.Pd"},{"$f":"+INPUT!$J$7","v":"Penata Muda"}]
[69,"XI IPA-2",null,null,null,null,null,null,"2013-07-24",2013,"",null,null,null,null,null,null,null,null,null,null,null,null,null,{"$f":"+INPUT!$I$7","v":"Sati fatchani,S.Pd"},{"$f":"+INPUT!$J$7","v":"Penata Muda"}]
[70,"XI IPA-2",null,null,null,null,null,null,"2013-07-24",2013,"",null,null,null,null,null,null,null,null,null,null,null,null,null,{"$f":"+INPUT!$I$7","v":"Sati fatchani,S.Pd"},{"$f":"+INPUT!$J$7","v":"Penata Muda"}]
[71,"XI IPA-2",null,null,null,null,null,null,"2013-07-24",2013,"",null,null,null,null,null,null,null,null,null,null,null,null,null,{"$f":"+INPUT!$I$7","v":"Sati fatchani,S.Pd"},{"$f":"+INPUT!$J$7","v":"Penata Muda"}]
[72,"XI IPA-2",null,null,null,null,null,null,"2013-07-24",2013,"",null,null,null,null,null,null,null,null,null,null,null,null,null,{"$f":"+INPUT!$I$7","v":"Sati fatchani,S.Pd"},{"$f":"+INPUT!$J$7","v":"Penata Muda"}]
[73,"XI IPA-2",null,null,null,null,null,null,"2013-07-24",2013,"",null,null,null,null,null,null,null,null,null,null,null,null,null,{"$f":"+INPUT!$I$7","v":"Sati fatchani,S.Pd"},{"$f":"+INPUT!$J$7","v":"Penata Muda"}]
[74,"XI IPA-2",null,null,null,null,null,null,"2013-07-24",2013,"",null,null,null,null,null,null,null,null,null,null,null,null,null,{"$f":"+INPUT!$I$7","v":"Sati fatchani,S.Pd"},{"$f":"+INPUT!$J$7","v":"Penata Muda"}]
[75,"XI IPA-2",null,null,null,null,null,null,"2013-07-24",2013,"",null,null,null,null,null,null,null,null,null,null,null,null,null,{"$f":"+INPUT!$I$7","v":"Sati fatchani,S.Pd"},{"$f":"+INPUT!$J$7","v":"Penata Muda"}]
[76,"XI IPA-2",null,null,null,null,null,null,"2013-07-24",2013,"",null,null,null,null,null,null,null,null,null,null,null,null,null,{"$f":"+INPUT!$I$7","v":"Sati fatchani,S.Pd"},{"$f":"+INPUT!$J$7","v":"Penata Muda"}]
[77,"XI IPA-2",null,null,null,null,null,null,"2013-07-24",2013,"",null,null,null,null,null,null,null,null,null,null,null,null,null,{"$f":"+INPUT!$I$7","v":"Sati fatchani,S.Pd"},{"$f":"+INPUT!$J$7","v":"Penata Muda"}]
[78,"XI IPA-2",null,null,null,null,null,null,"2013-07-24",2013,"",null,null,null,null,null,null,null,null,null,null,null,null,null,{"$f":"+INPUT!$I$7","v":"Sati fatchani,S.Pd"},{"$f":"+INPUT!$J$7","v":"Penata Muda"}]
[79,"XI IPA-2",null,null,null,null,null,null,"2013-07-24",2013,"",null,null,null,null,null,null,null,null,null,null,null,null,null,{"$f":"+INPUT!$I$7","v":"Sati fatchani,S.Pd"},{"$f":"+INPUT!$J$7","v":"Penata Muda"}]
[80,"XI IPA-2",null,null,null,null,null,null,"2013-07-24",2013,"",null,null,null,null,null,null,null,null,null,null,null,null,null,{"$f":"+INPUT!$I$7","v":"Sati fatchani,S.Pd"},{"$f":"+INPUT!$J$7","v":"Penata Muda"}]
[81,"XI IPA-2",null,null,null,null,null,null,"2013-07-24",2013,"",null,null,null,null,null,null,null,null,null,null,null,null,null,{"$f":"+INPUT!$I$7","v":"Sati fatchani,S.Pd"},{"$f":"+INPUT!$J$7","v":"Penata Muda"}]
[82,"XI IPA-2",null,null,null,null,null,null,"2013-07-24",2013,"",null,null,null,null,null,null,null,null,null,null,null,null,null,{"$f":"+INPUT!$I$7","v":"Sati fatchani,S.Pd"},{"$f":"+INPUT!$J$7","v":"Penata Muda"}]
[83,"XI IPA-2",null,null,null,null,null,null,{"$f":"TODAY()","v":"2013-07-24"},2013,"",null,null,null,null,null,null,null,null,null,null,null,null,null,{"$f":"+INPUT!$I$7","v":"Sati fatchani,S.Pd"},{"$f":"+INPUT!$J$7","v":"Penata Muda"}]
[84,"XI IPA-2",null,null,null,null,null,null,"2013-07-24",2013,"",null,null,null,null,null,null,null,null,null,null,null,null,null,{"$f":"+INPUT!$I$7","v":"Sati fatchani,S.Pd"},{"$f":"+INPUT!$J$7","v":"Penata Muda"}]
[85,"XI IPA-2",null,null,null,null,null,null,"2013-07-24",2013,"",null,null,null,null,null,null,null,null,null,null,null,null,null,{"$f":"+INPUT!$I$7","v":"Sati fatchani,S.Pd"},{"$f":"+INPUT!$J$7","v":"Penata Muda"}]
[86,"XI IPA-2",null,null,null,null,null,null,"2013-07-24",2013,"",null,null,null,null,null,null,null,null,null,null,null,null,null,{"$f":"+INPUT!$I$7","v":"Sati fatchani,S.Pd"},{"$f":"+INPUT!$J$7","v":"Penata Muda"}]
[87,"XI IPA-2",null,null,null,null,null,null,"2013-07-24",2013,"",null,null,null,null,null,null,null,null,null,null,null,null,null,{"$f":"+INPUT!$I$7","v":"Sati fatchani,S.Pd"},{"$f":"+INPUT!$J$7","v":"Penata Muda"}]
[88,"XI IPA-2",null,null,null,null,null,null,"2013-07-24",2013,"",null,null,null,null,null,null,null,null,null,null,null,null,null,{"$f":"+INPUT!$I$7","v":"Sati fatchani,S.Pd"},{"$f":"+INPUT!$J$7","v":"Penata Muda"}]
[89,"XI IPA-2",null,null,null,null,null,null,"2013-07-24",2013,"",null,null,null,null,null,null,null,null,null,null,null,null,null,{"$f":"+INPUT!$I$7","v":"Sati fatchani,S.Pd"},{"$f":"+INPUT!$J$7","v":"Penata Muda"}]
[90,"XI IPA-2",null,null,null,null,null,null,"2013-07-24",2013,"",null,null,null,null,null,null,null,null,null,null,null,null,null,{"$f":"+INPUT!$I$7","v":"Sati fatchani,S.Pd"},{"$f":"+INPUT!$J$7","v":"Penata Muda"}]
[null,null,null,null,null,{"$f":"COUNTIF(F62:F106,\"L\")","v":1},"Laki-laki",null,"14 Th",{"$f":"+K107/$F$52*100%","v":0},{"$f":"COUNTIF(K62:K106,\"14\")","v":0},null,"BURUH HARIAN",0,null,null,null,null,null,"SMP",{"$f":"COUNTIF(U62:U106,\"SMP\")","v":0},"Islam",{"$f":"COUNTIF(W62:W106,\"Islam\")","v":0}]
[null,null,null,null,null,{"$f":"COUNTIF(F62:F106,\"P\")","v":0},"Perempuan",null,"15 Th",{"$f":"+K108/$F$52*100%","v":0},{"$f":"COUNTIF(K62:K106,\"15\")","v":0},null,"PEG / KARY. SWASTA",0,null,null,null,null,null,"MTs",{"$f":"COUNTIF(U62:U106,\"MTs\")","v":0},"Katolik",{"$f":"COUNTIF(W62:W106,\"Katolik\")","v":0}]
[null,null,null,null,null,{"$f":"SUM(F107:F108)","v":1},"Total Siswa",null,"16 Th",{"$f":"+K109/$F$52*100%","v":1},{"$f":"COUNTIF(K62:K106,\"16\")","v":1},null,"PNS",0,null,null,null,null,null,"Lainnya",{"$f":"+U107+U108","v":0},"Protestan",{"$f":"COUNTIF(W62:W106,\"Protestan\")","v":0}]
[null,null,null,null,null,null,null,null,"17 Th",0,{"$f":"COUNTIF(K62:K106,\"17\")","v":0},null,"WIRASWASTA",0,null,null,null,null,null,null,null,"Hindu",{"$f":"COUNTIF(W62:W106,\"Hindu\")","v":0}]
[null,null,null,null,null,null,null,null,"18 Th",0,{"$f":"COUNTIF(K62:K106,\"18\")","v":0},null,"KARY/ PEGAWAI .BUMN",0,null,null,null,null,null,null,null,"Budha",{"$f":"COUNTIF(W62:W106,\"Budha\")","v":0}]
[null,null,null,null,null,null,null,null,"19 Th",0,{"$f":"COUNTIF(K62:K106,\"19\")","v":0},null,"KEPOLISIAN",0,null,null,null,null,null,null,null,null,{"$f":"SUM(W107:W111)","v":0}]
[null,null,null,null,null,null,null,null,"20 Th",0,{"$f":"COUNTIF(K62:K106,\"20\")","v":0},null,"PENSIUNAN",0]
[null,null,null,null,null,null,null,null,"TOTAL",1,{"$f":"SUM(K107:K113)","v":1},null,"HONORER",0]
[null,null,null,null,null,null,null,null,null,null,null,null,"GURU",0]
[null,null,null,null,null,null,null,null,null,null,null,null,"TAK ADA DATA",0]
[null,null,null,null,null,null,null,null,null,null,null,null,"TOTAL DATA",0]
[null,{"$f":"MAX(A62:A106)","v":90}]
[{"$f":"+$B$118+1","v":91},{"$f":"+INPUT!$H$8","v":"XI IPA-3"},"ADE HAIRUNISA MARDIAH",12130004,"9966517605","P","CILEGON","1996-02-26",{"$f":"TODAY()","v":"2013-07-24"},{"$f":"+$J$3","v":2013},{"$f":"IF(H119=\"\",\"\",DATEDIF(H119,I119,\"y\"))","v":17},null,null,null,null,null,null,null,null,null,null,null,null,null,{"$f":"+INPUT!$I$8","v":"Ragil Widyaningsih,S.Pd"},{"$f":"+INPUT!$J$8","v":"Penata Muda"},null,null,null,{"$f":"+B119","v":"XI IPA-3"}]
[{"$f":"+A119+1","v":92},{"$f":"IF(A120=0,\" \",+B119)","v":"XI IPA-3"},null,null,null,null,null,null,{"$f":"TODAY()","v":"2013-07-24"},2013,{"$f":"IF(H120=\"\",\"\",DATEDIF(H120,I120,\"y\"))","v":""},null,null,null,null,null,null,null,null,null,null,null,null,null,{"$f":"+INPUT!$I$8","v":"Ragil Widyaningsih,S.Pd"},{"$f":"+INPUT!$J$8","v":"Penata Muda"}]
[{"$f":"+A120+1","v":93},{"$f":"IF(A121=0,\" \",+B120)","v":"XI IPA-3"},null,null,null,null,null,null,"2013-07-24",2013,"",null,null,null,null,null,null,null,null,null,null,null,null,null,{"$f":"+INPUT!$I$8","v":"Ragil Widyaningsih,S.Pd"},{"$f":"+INPUT!$J$8","v":"Penata Muda"}]
[94,{"$f":"IF(A122=0,\" \",+B121)","v":"XI IPA-3"},null,null,null,null,null,null,"2013-07-24",2013,"",null,null,null,null,null,null,null,null,null,null,null,null,null,{"$f":"+INPUT!$I$8","v":"Ragil Widyaningsih,S.Pd"},{"$f":"+INPUT!$J$8","v":"Penata Muda"}]
[95,"XI IPA-3",null,null,null,null,null,null,"2013-07-24",2013,"",null,null,null,null,null,null,null,null,null,null,null,null,null,{"$f":"+INPUT!$I$8","v":"Ragil Widyaningsih,S.Pd"},{"$f":"+INPUT!$J$8","v":"Penata Muda"}]
[96,"XI IPA-3",null,null,null,null,null,null,"2013-07-24",2013,"",null,null,null,null,null,null,null,null,null,null,null,null,null,{"$f":"+INPUT!$I$8","v":"Ragil Widyaningsih,S.Pd"},{"$f":"+INPUT!$J$8","v":"Penata Muda"}]
[97,"XI IPA-3",null,null,null,null,null,null,"2013-07-24",2013,"",null,null,null,null,null,null,null,null,null,null,null,null,null,{"$f":"+INPUT!$I$8","v":"Ragil Widyaningsih,S.Pd"},{"$f":"+INPUT!$J$8","v":"Penata Muda"}]
[98,"XI IPA-3",null,null,null,null,null,null,"2013-07-24",2013,"",null,null,null,null,null,null,null,null,null,null,null,null,null,{"$f":"+INPUT!$I$8","v":"Ragil Widyaningsih,S.Pd"},{"$f":"+INPUT!$J$8","v":"Penata Muda"}]
[99,"XI IPA-3",null,null,null,null,null,null,"2013-07-24",2013,"",null,null,null,null,null,null,null,null,null,null,null,null,null,{"$f":"+INPUT!$I$8","v":"Ragil Widyaningsih,S.Pd"},{"$f":"+INPUT!$J$8","v":"Penata Muda"}]
[100,"XI IPA-3",null,null,null,null,null,null,"2013-07-24",2013,"",null,null,null,null,null,null,null,null,null,null,null,null,null,{"$f":"+INPUT!$I$8","v":"Ragil Widyaningsih,S.Pd"},{"$f":"+INPUT!$J$8","v":"Penata Muda"}]
[101,"XI IPA-3",null,null,null,null,null,null,"2013-07-24",2013,"",null,null,null,null,null,null,null,null,null,null,null,null,null,{"$f":"+INPUT!$I$8","v":"Ragil Widyaningsih,S.Pd"},{"$f":"+INPUT!$J$8","v":"Penata Muda"}]
[102,"XI IPA-3",null,null,null,null,null,null,"2013-07-24",2013,"",null,null,null,null,null,null,null,null,null,null,null,null,null,{"$f":"+INPUT!$I$8","v":"Ragil Widyaningsih,S.Pd"},{"$f":"+INPUT!$J$8","v":"Penata Muda"}]
[103,"XI IPA-3",null,null,null,null,null,null,"2013-07-24",2013,"",null,null,null,null,null,null,null,null,null,null,null,null,null,{"$f":"+INPUT!$I$8","v":"Ragil Widyaningsih,S.Pd"},{"$f":"+INPUT!$J$8","v":"Penata Muda"}]
[104,"XI IPA-3",null,null,null,null,null,null,"2013-07-24",2013,"",null,null,null,null,null,null,null,null,null,null,null,null,null,{"$f":"+INPUT!$I$8","v":"Ragil Widyaningsih,S.Pd"},{"$f":"+INPUT!$J$8","v":"Penata Muda"}]
[105,"XI IPA-3",null,null,null,null,null,null,"2013-07-24",2013,"",null,null,null,null,null,null,null,null,null,null,null,null,null,{"$f":"+INPUT!$I$8","v":"Ragil Widyaningsih,S.Pd"},{"$f":"+INPUT!$J$8","v":"Penata Muda"}]
[106,"XI IPA-3",null,null,null,null,null,null,"2013-07-24",2013,"",null,null,null,null,null,null,null,null,null,null,null,null,null,{"$f":"+INPUT!$I$8","v":"Ragil Widyaningsih,S.Pd"},{"$f":"+INPUT!$J$8","v":"Penata Muda"}]
[107,"XI IPA-3",null,null,null,null,null,null,"2013-07-24",2013,"",null,null,null,null,null,null,null,null,null,null,null,null,null,{"$f":"+INPUT!$I$8","v":"Ragil Widyaningsih,S.Pd"},{"$f":"+INPUT!$J$8","v":"Penata Muda"}]
[108,"XI IPA-3",null,null,null,null,null,null,"2013-07-24",2013,"",null,null,null,null,null,null,null,null,null,null,null,null,null,{"$f":"+INPUT!$I$8","v":"Ragil Widyaningsih,S.Pd"},{"$f":"+INPUT!$J$8","v":"Penata Muda"}]
[109,"XI IPA-3",null,null,null,null,null,null,"2013-07-24",2013,"",null,null,null,null,null,null,null,null,null,null,null,null,null,{"$f":"+INPUT!$I$8","v":"Ragil Widyaningsih,S.Pd"},{"$f":"+INPUT!$J$8","v":"Penata Muda"}]
[110,"XI IPA-3",null,null,null,null,null,null,"2013-07-24",2013,"",null,null,null,null,null,null,null,null,null,null,null,null,null,{"$f":"+INPUT!$I$8","v":"Ragil Widyaningsih,S.Pd"},{"$f":"+INPUT!$J$8","v":"Penata Muda"}]
[111,"XI IPA-3",null,null,null,null,null,null,"2013-07-24",2013,"",null,null,null,null,null,null,null,null,null,null,null,null,null,{"$f":"+INPUT!$I$8","v":"Ragil Widyaningsih,S.Pd"},{"$f":"+INPUT!$J$8","v":"Penata Muda"}]
[112,"XI IPA-3",null,null,null,null,null,null,"2013-07-24",2013,"",null,null,null,null,null,null,null,null,null,null,null,null,null,{"$f":"+INPUT!$I$8","v":"Ragil Widyaningsih,S.Pd"},{"$f":"+INPUT!$J$8","v":"Penata Muda"}]
[113,"XI IPA-3",null,null,null,null,null,null,"2013-07-24",2013,"",null,null,null,null,null,null,null,null,null,null,null,null,null,{"$f":"+INPUT!$I$8","v":"Ragil Widyaningsih,S.Pd"},{"$f":"+INPUT!$J$8","v":"Penata Muda"}]
[114,"XI IPA-3",null,null,null,null,null,null,"2013-07-24",2013,"",null,null,null,null,null,null,null,null,null,null,null,null,null,{"$f":"+INPUT!$I$8","v":"Ragil Widyaningsih,S.Pd"},{"$f":"+INPUT!$J$8","v":"Penata Muda"}]
[115,"XI IPA-3",null,null,null,null,null,null,"2013-07-24",2013,"",null,null,null,null,null,null,null,null,null,null,null,null,null,{"$f":"+INPUT!$I$8","v":"Ragil Widyaningsih,S.Pd"},{"$f":"+INPUT!$J$8","v":"Penata Muda"}]
[116,"XI IPA-3",null,null,null,null,null,null,"2013-07-24",2013,"",null,null,null,null,null,null,null,null,null,null,null,null,null,{"$f":"+INPUT!$I$8","v":"Ragil Widyaningsih,S.Pd"},{"$f":"+INPUT!$J$8","v":"Penata Muda"}]
[117,"XI IPA-3",null,null,null,null,null,null,"2013-07-24",2013,"",null,null,null,null,null,null,null,null,null,null,null,null,null,{"$f":"+INPUT!$I$8","v":"Ragil Widyaningsih,S.Pd"},{"$f":"+INPUT!$J$8","v":"Penata Muda"}]
[118,"XI IPA-3",null,null,null,null,null,null,"2013-07-24",2013,"",null,null,null,null,null,null,null,null,null,null,null,null,null,{"$f":"+INPUT!$I$8","v":"Ragil Widyaningsih,S.Pd"},{"$f":"+INPUT!$J$8","v":"Penata Muda"}]
[119,"XI IPA-3",null,null,null,null,null,null,"2013-07-24",2013,"",null,null,null,null,null,null,null,null,null,null,null,null,null,{"$f":"+INPUT!$I$8","v":"Ragil Widyaningsih,S.Pd"},{"$f":"+INPUT!$J$8","v":"Penata Muda"}]
[120,"XI IPA-3",null,null,null,null,null,null,"2013-07-24",2013,"",null,null,null,null,null,null,null,null,null,null,null,null,null,{"$f":"+INPUT!$I$8","v":"Ragil Widyaningsih,S.Pd"},{"$f":"+INPUT!$J$8","v":"Penata Muda"}]
[121,"XI IPA-3",null,null,null,null,null,null,"2013-07-24",2013,"",null,null,null,null,null,null,null,null,null,null,null,null,null,{"$f":"+INPUT!$I$8","v":"Ragil Widyaningsih,S.Pd"},{"$f":"+INPUT!$J$8","v":"Penata Muda"}]
[122,"XI IPA-3",null,null,null,null,null,null,"2013-07-24",2013,"",null,null,null,null,null,null,null,null,null,null,null,null,null,{"$f":"+INPUT!$I$8","v":"Ragil Widyaningsih,S.Pd"},{"$f":"+INPUT!$J$8","v":"Penata Muda"}]
[123,"XI IPA-3",null,null,null,null,null,null,"2013-07-24",2013,"",null,null,null,null,null,null,null,null,null,null,null,null,null,{"$f":"+INPUT!$I$8","v":"Ragil Widyaningsih,S.Pd"},{"$f":"+INPUT!$J$8","v":"Penata Muda"}]
[124,"XI IPA-3",null,null,null,null,null,null,"2013-07-24",2013,"",null,null,null,null,null,null,null,null,null,null,null,null,null,{"$f":"+INPUT!$I$8","v":"Ragil Widyaningsih,S.Pd"},{"$f":"+INPUT!$J$8","v":"Penata Muda"}]
[125,"XI IPA-3",null,null,null,null,null,null,"2013-07-24",2013,"",null,null,null,null,null,null,null,null,null,null,null,null,null,{"$f":"+INPUT!$I$8","v":"Ragil Widyaningsih,S.Pd"},{"$f":"+INPUT!$J$8","v":"Penata Muda"}]
[126,"XI IPA-3",null,null,null,null,null,null,"2013-07-24",2013,"",null,null,null,null,null,null,null,null,null,null,null,null,null,{"$f":"+INPUT!$I$8","v":"Ragil Widyaningsih,S.Pd"},{"$f":"+INPUT!$J$8","v":"Penata Muda"}]
[127,"XI IPA-3",null,null,null,null,null,null,"2013-07-24",2013,"",null,null,null,null,null,null,null,null,null,null,null,null,null,{"$f":"+INPUT!$I$8","v":"Ragil Widyaningsih,S.Pd"},{"$f":"+INPUT!$J$8","v":"Penata Muda"}]
[128,"XI IPA-3",null,null,null,null,null,null,{"$f":"TODAY()","v":"2013-07-24"},2013,"",null,null,null,null,null,null,null,null,null,null,null,null,null,{"$f":"+INPUT!$I$8","v":"Ragil Widyaningsih,S.Pd"},{"$f":"+INPUT!$J$8","v":"Penata Muda"}]
[129,"XI IPA-3",null,null,null,null,null,null,"2013-07-24",2013,"",null,null,null,null,null,null,null,null,null,null,null,null,null,{"$f":"+INPUT!$I$8","v":"Ragil Widyaningsih,S.Pd"},{"$f":"+INPUT!$J$8","v":"Penata Muda"}]
[130,"XI IPA-3",null,null,null,null,null,null,"2013-07-24",2013,"",null,null,null,null,null,null,null,null,null,null,null,null,null,{"$f":"+INPUT!$I$8","v":"Ragil Widyaningsih,S.Pd"},{"$f":"+INPUT!$J$8","v":"Penata Muda"}]
[131,"XI IPA-3",null,null,null,null,null,null,"2013-07-24",2013,"",null,null,null,null,null,null,null,null,null,null,null,null,null,{"$f":"+INPUT!$I$8","v":"Ragil Widyaningsih,S.Pd"},{"$f":"+INPUT!$J$8","v":"Penata Muda"}]
[132,"XI IPA-3",null,null,null,null,null,null,"2013-07-24",2013,"",null,null,null,null,null,null,null,null,null,null,null,null,null,{"$f":"+INPUT!$I$8","v":"Ragil Widyaningsih,S.Pd"},{"$f":"+INPUT!$J$8","v":"Penata Muda"}]
[133,"XI IPA-3",null,null,null,null,null,null,"2013-07-24",2013,"",null,null,null,null,null,null,null,null,null,null,null,null,null,{"$f":"+INPUT!$I$8","v":"Ragil Widyaningsih,S.Pd"},{"$f":"+INPUT!$J$8","v":"Penata Muda"}]
[134,"XI IPA-3",null,null,null,null,null,null,"2013-07-24",2013,"",null,null,null,null,null,null,null,null,null,null,null,null,null,{"$f":"+INPUT!$I$8","v":"Ragil Widyaningsih,S.Pd"},{"$f":"+INPUT!$J$8","v":"Penata Muda"}]
[135,"XI IPA-3",null,null,null,null,null,null,"2013-07-24",2013,"",null,null,null,null,null,null,null,null,null,null,null,null,null,{"$f":"+INPUT!$I$8","v":"Ragil Widyaningsih,S.Pd"},{"$f":"+INPUT!$J$8","v":"Penata Muda"}]
[null,null,null,null,null,{"$f":"COUNTIF(F119:F163,\"L\")","v":0},"Laki-laki",null,"14 Th",{"$f":"+K164/$F$52*100%","v":0},{"$f":"COUNTIF(K119:K163,\"14\")","v":0},null,"BURUH HARIAN",0,null,null,null,null,null,"SMP",{"$f":"COUNTIF(U119:U163,\"SMP\")","v":0},"Islam",{"$f":"COUNTIF(W119:W163,\"Islam\")","v":0},null,null,{"$f":"+INPUT!$J$8","v":"Penata Muda"}]
[null,null,null,null,null,{"$f":"COUNTIF(F119:F163,\"P\")","v":1},"Perempuan",null,"15 Th",{"$f":"+K165/$F$52*100%","v":0},{"$f":"COUNTIF(K119:K163,\"15\")","v":0},null,"PEG / KARY. SWASTA",0,null,null,null,null,null,"MTs",{"$f":"COUNTIF(U119:U163,\"MTs\")","v":0},"Katolik",{"$f":"COUNTIF(W119:W163,\"Katolik\")","v":0},null,null,{"$f":"+INPUT!$J$8","v":"Penata Muda"}]
[null,null,null,null,null,{"$f":"SUM(F164:F165)","v":1},"Total Siswa",null,"16 Th",{"$f":"+K166/$F$52*100%","v":0},{"$f":"COUNTIF(K119:K163,\"16\")","v":0},null,"PNS",0,null,null,null,null,null,"Lainnya",{"$f":"+U164+U165","v":0},"Protestan",{"$f":"COUNTIF(W119:W163,\"Protestan\")","v":0},null,null,{"$f":"+INPUT!$J$8","v":"Penata Muda"}]
[null,null,null,null,null,null,null,null,"17 Th",1,{"$f":"COUNTIF(K119:K163,\"17\")","v":1},null,"WIRASWASTA",0,null,null,null,null,null,null,null,"Hindu",{"$f":"COUNTIF(W119:W163,\"Hindu\")","v":0},null,null,{"$f":"+INPUT!$J$8","v":"Penata Muda"}]
[null,null,null,null,null,null,null,null,"18 Th",0,{"$f":"COUNTIF(K119:K163,\"18\")","v":0},null,"KARY/ PEGAWAI .BUMN",0,null,null,null,null,null,null,null,"Budha",{"$f":"COUNTIF(W119:W163,\"Budha\")","v":0},null,null,{"$f":"+INPUT!$J$8","v":"Penata Muda"}]
[null,null,null,null,null,null,null,null,"19 Th",0,{"$f":"COUNTIF(K119:K163,\"19\")","v":0},null,"KEPOLISIAN",0,null,null,null,null,null,null,null,null,{"$f":"SUM(W164:W168)","v":0},null,null,{"$f":"+INPUT!$J$8","v":"Penata Muda"}]
[null,null,null,null,null,null,null,null,"20 Th",0,{"$f":"COUNTIF(K119:K163,\"20\")","v":0},null,"PENSIUNAN",0,null,null,null,null,null,null,null,null,null,null,null,{"$f":"+INPUT!$J$8","v":"Penata Muda"}]
[null,null,null,null,null,null,null,null,"TOTAL",1,{"$f":"SUM(K164:K170)","v":1},null,"HONORER",0,null,null,null,null,null,null,null,null,null,null,null,{"$f":"+INPUT!$J$8","v":"Penata Muda"}]
[null,null,null,null,null,null,null,null,null,null,null,null,"GURU",0,null,null,null,null,null,null,null,null,null,null,null,{"$f":"+INPUT!$J$8","v":"Penata Muda"}]
[null,null,null,null,null,null,null,null,null,null,null,null,"TAK ADA DATA",0,null,null,null,null,null,null,null,null,null,null,null,{"$f":"+INPUT!$J$8","v":"Penata Muda"}]
[null,null,null,null,null,null,null,null,null,null,null,null,"TOTAL DATA",0,null,null,null,null,null,null,null,null,null,null,null,{"$f":"+INPUT!$J$8","v":"Penata Muda"}]
[null,{"$f":"MAX(A119:A163)","v":135},null,null,null,null,null,null,null,null,null,null,null,null,null,null,null,null,null,null,null,null,null,null,null,{"$f":"+INPUT!$J$8","v":"Penata Muda"}]
[{"$f":"+$B$175+1","v":136},{"$f":"+INPUT!$H$9","v":"XI IPS-1"},"AAM TAMIMI",12130001,"9970454991","L","CILEGON","1997-05-04",{"$f":"TODAY()","v":"2013-07-24"},{"$f":"+$J$3","v":2013},{"$f":"IF(H176=\"\",\"\",DATEDIF(H176,I176,\"y\"))","v":16},null,null,null,null,null,null,null,null,null,null,null,null,null,{"$f":"+INPUT!$I$9","v":"Dian Lestari,S.PD"},{"$f":"+INPUT!$J$9","v":"Penata Muda"},null,null,null,{"$f":"+B176","v":"XI IPS-1"}]
[{"$f":"+A176+1","v":137},{"$f":"IF(A177=0,\" \",+B176)","v":"XI IPS-1"},null,null,null,null,null,null,{"$f":"TODAY()","v":"2013-07-24"},2013,{"$f":"IF(H177=\"\",\"\",DATEDIF(H177,I177,\"y\"))","v":""},null,null,null,null,null,null,null,null,null,null,null,null,null,{"$f":"+INPUT!$I$9","v":"Dian Lestari,S.PD"},{"$f":"+INPUT!$J$9","v":"Penata Muda"}]
[{"$f":"+A177+1","v":138},{"$f":"IF(A178=0,\" \",+B177)","v":"XI IPS-1"},null,null,null,null,null,null,"2013-07-24",2013,"",null,null,null,null,null,null,null,null,null,null,null,null,null,{"$f":"+INPUT!$I$9","v":"Dian Lestari,S.PD"},{"$f":"+INPUT!$J$9","v":"Penata Muda"}]
[139,{"$f":"IF(A179=0,\" \",+B178)","v":"XI IPS-1"},null,null,null,null,null,null,"2013-07-24",2013,"",null,null,null,null,null,null,null,null,null,null,null,null,null,{"$f":"+INPUT!$I$9","v":"Dian Lestari,S.PD"},{"$f":"+INPUT!$J$9","v":"Penata Muda"}]
[140,"XI IPS-1",null,null,null,null,null,null,"2013-07-24",2013,"",null,null,null,null,null,null,null,null,null,null,null,null,null,{"$f":"+INPUT!$I$9","v":"Dian Lestari,S.PD"},{"$f":"+INPUT!$J$9","v":"Penata Muda"}]
[141,"XI IPS-1",null,null,null,null,null,null,"2013-07-24",2013,"",null,null,null,null,null,null,null,null,null,null,null,null,null,{"$f":"+INPUT!$I$9","v":"Dian Lestari,S.PD"},{"$f":"+INPUT!$J$9","v":"Penata Muda"}]
[142,"XI IPS-1",null,null,null,null,null,null,"2013-07-24",2013,"",null,null,null,null,null,null,null,null,null,null,null,null,null,{"$f":"+INPUT!$I$9","v":"Dian Lestari,S.PD"},{"$f":"+INPUT!$J$9","v":"Penata Muda"}]
[143,"XI IPS-1",null,null,null,null,null,null,"2013-07-24",2013,"",null,null,null,null,null,null,null,null,null,null,null,null,null,{"$f":"+INPUT!$I$9","v":"Dian Lestari,S.PD"},{"$f":"+INPUT!$J$9","v":"Penata Muda"}]
[144,"XI IPS-1",null,null,null,null,null,null,"2013-07-24",2013,"",null,null,null,null,null,null,null,null,null,null,null,null,null,{"$f":"+INPUT!$I$9","v":"Dian Lestari,S.PD"},{"$f":"+INPUT!$J$9","v":"Penata Muda"}]
[145,"XI IPS-1",null,null,null,null,null,null,"2013-07-24",2013,"",null,null,null,null,null,null,null,null,null,null,null,null,null,{"$f":"+INPUT!$I$9","v":"Dian Lestari,S.PD"},{"$f":"+INPUT!$J$9","v":"Penata Muda"}]
[146,"XI IPS-1",null,null,null,null,null,null,"2013-07-24",2013,"",null,null,null,null,null,null,null,null,null,null,null,null,null,{"$f":"+INPUT!$I$9","v":"Dian Lestari,S.PD"},{"$f":"+INPUT!$J$9","v":"Penata Muda"}]
[147,"XI IPS-1",null,null,null,null,null,null,"2013-07-24",2013,"",null,null,null,null,null,null,null,null,null,null,null,null,null,{"$f":"+INPUT!$I$9","v":"Dian Lestari,S.PD"},{"$f":"+INPUT!$J$9","v":"Penata Muda"}]
[148,"XI IPS-1",null,null,null,null,null,null,"2013-07-24",2013,"",null,null,null,null,null,null,null,null,null,null,null,null,null,{"$f":"+INPUT!$I$9","v":"Dian Lestari,S.PD"},{"$f":"+INPUT!$J$9","v":"Penata Muda"}]
[149,"XI IPS-1",null,null,null,null,null,null,"2013-07-24",2013,"",null,null,null,null,null,null,null,null,null,null,null,null,null,{"$f":"+INPUT!$I$9","v":"Dian Lestari,S.PD"},{"$f":"+INPUT!$J$9","v":"Penata Muda"}]
[150,"XI IPS-1",null,null,null,null,null,null,"2013-07-24",2013,"",null,null,null,null,null,null,null,null,null,null,null,null,null,{"$f":"+INPUT!$I$9","v":"Dian Lestari,S.PD"},{"$f":"+INPUT!$J$9","v":"Penata Muda"}]
[151,"XI IPS-1",null,null,null,null,null,null,"2013-07-24",2013,"",null,null,null,null,null,null,null,null,null,null,null,null,null,{"$f":"+INPUT!$I$9","v":"Dian Lestari,S.PD"},{"$f":"+INPUT!$J$9","v":"Penata Muda"}]
[152,"XI IPS-1",null,null,null,null,null,null,"2013-07-24",2013,"",null,null,null,null,null,null,null,null,null,null,null,null,null,{"$f":"+INPUT!$I$9","v":"Dian Lestari,S.PD"},{"$f":"+INPUT!$J$9","v":"Penata Muda"}]
[153,"XI IPS-1",null,null,null,null,null,null,"2013-07-24",2013,"",null,null,null,null,null,null,null,null,null,null,null,null,null,{"$f":"+INPUT!$I$9","v":"Dian Lestari,S.PD"},{"$f":"+INPUT!$J$9","v":"Penata Muda"}]
[154,"XI IPS-1",null,null,null,null,null,null,"2013-07-24",2013,"",null,null,null,null,null,null,null,null,null,null,null,null,null,{"$f":"+INPUT!$I$9","v":"Dian Lestari,S.PD"},{"$f":"+INPUT!$J$9","v":"Penata Muda"}]
[155,"XI IPS-1",null,null,null,null,null,null,"2013-07-24",2013,"",null,null,null,null,null,null,null,null,null,null,null,null,null,{"$f":"+INPUT!$I$9","v":"Dian Lestari,S.PD"},{"$f":"+INPUT!$J$9","v":"Penata Muda"}]
[156,"XI IPS-1",null,null,null,null,null,null,"2013-07-24",2013,"",null,null,null,null,null,null,null,null,null,null,null,null,null,{"$f":"+INPUT!$I$9","v":"Dian Lestari,S.PD"},{"$f":"+INPUT!$J$9","v":"Penata Muda"}]
[157,"XI IPS-1",null,null,null,null,null,null,"2013-07-24",2013,"",null,null,null,null,null,null,null,null,null,null,null,null,null,{"$f":"+INPUT!$I$9","v":"Dian Lestari,S.PD"},{"$f":"+INPUT!$J$9","v":"Penata Muda"}]
[158,"XI IPS-1",null,null,null,null,null,null,"2013-07-24",2013,"",null,null,null,null,null,null,null,null,null,null,null,null,null,{"$f":"+INPUT!$I$9","v":"Dian Lestari,S.PD"},{"$f":"+INPUT!$J$9","v":"Penata Muda"}]
[159,"XI IPS-1",null,null,null,null,null,null,"2013-07-24",2013,"",null,null,null,null,null,null,null,null,null,null,null,null,null,{"$f":"+INPUT!$I$9","v":"Dian Lestari,S.PD"},{"$f":"+INPUT!$J$9","v":"Penata Muda"}]
[160,"XI IPS-1",null,null,null,null,null,null,"2013-07-24",2013,"",null,null,null,null,null,null,null,null,null,null,null,null,null,{"$f":"+INPUT!$I$9","v":"Dian Lestari,S.PD"},{"$f":"+INPUT!$J$9","v":"Penata Muda"}]
[161,"XI IPS-1",null,null,null,null,null,null,"2013-07-24",2013,"",null,null,null,null,null,null,null,null,null,null,null,null,null,{"$f":"+INPUT!$I$9","v":"Dian Lestari,S.PD"},{"$f":"+INPUT!$J$9","v":"Penata Muda"}]
[162,"XI IPS-1",null,null,null,null,null,null,"2013-07-24",2013,"",null,null,null,null,null,null,null,null,null,null,null,null,null,{"$f":"+INPUT!$I$9","v":"Dian Lestari,S.PD"},{"$f":"+INPUT!$J$9","v":"Penata Muda"}]
[163,"XI IPS-1",null,null,null,null,null,null,"2013-07-24",2013,"",null,null,null,null,null,null,null,null,null,null,null,null,null,{"$f":"+INPUT!$I$9","v":"Dian Lestari,S.PD"},{"$f":"+INPUT!$J$9","v":"Penata Muda"}]
[164,"XI IPS-1",null,null,null,null,null,null,"2013-07-24",2013,"",null,null,null,null,null,null,null,null,null,null,null,null,null,{"$f":"+INPUT!$I$9","v":"Dian Lestari,S.PD"},{"$f":"+INPUT!$J$9","v":"Penata Muda"}]
[165,"XI IPS-1",null,null,null,null,null,null,"2013-07-24",2013,"",null,null,null,null,null,null,null,null,null,null,null,null,null,{"$f":"+INPUT!$I$9","v":"Dian Lestari,S.PD"},{"$f":"+INPUT!$J$9","v":"Penata Muda"}]
[166,"XI IPS-1",null,null,null,null,null,null,"2013-07-24",2013,"",null,null,null,null,null,null,null,null,null,null,null,null,null,{"$f":"+INPUT!$I$9","v":"Dian Lestari,S.PD"},{"$f":"+INPUT!$J$9","v":"Penata Muda"}]
[167,"XI IPS-1",null,null,null,null,null,null,"2013-07-24",2013,"",null,null,null,null,null,null,null,null,null,null,null,null,null,{"$f":"+INPUT!$I$9","v":"Dian Lestari,S.PD"},{"$f":"+INPUT!$J$9","v":"Penata Muda"}]
[168,"XI IPS-1",null,null,null,null,null,null,"2013-07-24",2013,"",null,null,null,null,null,null,null,null,null,null,null,null,null,{"$f":"+INPUT!$I$9","v":"Dian Lestari,S.PD"},{"$f":"+INPUT!$J$9","v":"Penata Muda"}]
[169,"XI IPS-1",null,null,null,null,null,null,"2013-07-24",2013,"",null,null,null,null,null,null,null,null,null,null,null,null,null,{"$f":"+INPUT!$I$9","v":"Dian Lestari,S.PD"},{"$f":"+INPUT!$J$9","v":"Penata Muda"}]
[170,"XI IPS-1",null,null,null,null,null,null,"2013-07-24",2013,"",null,null,null,null,null,null,null,null,null,null,null,null,null,{"$f":"+INPUT!$I$9","v":"Dian Lestari,S.PD"},{"$f":"+INPUT!$J$9","v":"Penata Muda"}]
[171,"XI IPS-1",null,null,null,null,null,null,"2013-07-24",2013,"",null,null,null,null,null,null,null,null,null,null,null,null,null,{"$f":"+INPUT!$I$9","v":"Dian Lestari,S.PD"},{"$f":"+INPUT!$J$9","v":"Penata Muda"}]
[172,"XI IPS-1",null,null,null,null,null,null,"2013-07-24",2013,"",null,null,null,null,null,null,null,null,null,null,null,null,null,{"$f":"+INPUT!$I$9","v":"Dian Lestari,S.PD"},{"$f":"+INPUT!$J$9","v":"Penata Muda"}]
[173,"XI IPS-1",null,null,null,null,null,null,{"$f":"TODAY()","v":"2013-07-24"},2013,"",null,null,null,null,null,null,null,null,null,null,null,null,null,{"$f":"+INPUT!$I$9","v":"Dian Lestari,S.PD"},{"$f":"+INPUT!$J$9","v":"Penata Muda"}]
[174,"XI IPS-1",null,null,null,null,null,null,"2013-07-24",2013,"",null,null,null,null,null,null,null,null,null,null,null,null,null,{"$f":"+INPUT!$I$9","v":"Dian Lestari,S.PD"},{"$f":"+INPUT!$J$9","v":"Penata Muda"}]
[175,"XI IPS-1",null,null,null,null,null,null,"2013-07-24",2013,"",null,null,null,null,null,null,null,null,null,null,null,null,null,{"$f":"+INPUT!$I$9","v":"Dian Lestari,S.PD"},{"$f":"+INPUT!$J$9","v":"Penata Muda"}]
[176,"XI IPS-1",null,null,null,null,null,null,"2013-07-24",2013,"",null,null,null,null,null,null,null,null,null,null,null,null,null,{"$f":"+INPUT!$I$9","v":"Dian Lestari,S.PD"},{"$f":"+INPUT!$J$9","v":"Penata Muda"}]
[177,"XI IPS-1",null,null,null,null,null,null,"2013-07-24",2013,"",null,null,null,null,null,null,null,null,null,null,null,null,null,{"$f":"+INPUT!$I$9","v":"Dian Lestari,S.PD"},{"$f":"+INPUT!$J$9","v":"Penata Muda"}]
[178,"XI IPS-1",null,null,null,null,null,null,"2013-07-24",2013,"",null,null,null,null,null,null,null,null,null,null,null,null,null,{"$f":"+INPUT!$I$9","v":"Dian Lestari,S.PD"},{"$f":"+INPUT!$J$9","v":"Penata Muda"}]
[179,"XI IPS-1",null,null,null,null,null,null,"2013-07-24",2013,"",null,null,null,null,null,null,null,null,null,null,null,null,null,{"$f":"+INPUT!$I$9","v":"Dian Lestari,S.PD"},{"$f":"+INPUT!$J$9","v":"Penata Muda"}]
[180,"XI IPS-1",null,null,null,null,null,null,"2013-07-24",2013,"",null,null,null,null,null,null,null,null,null,null,null,null,null,{"$f":"+INPUT!$I$9","v":"Dian Lestari,S.PD"},{"$f":"+INPUT!$J$9","v":"Penata Muda"}]
[null,null,null,null,null,{"$f":"COUNTIF(F176:F220,\"L\")","v":1},"Laki-laki",null,"14 Th",{"$f":"+K221/$F$52*100%","v":0},{"$f":"COUNTIF(K176:K220,\"14\")","v":0},null,"BURUH HARIAN",null,null,null,null,null,null,"SMP",20,"Islam",33,null,null,{"$f":"+INPUT!$J$9","v":"Penata Muda"}]
[null,null,null,null,null,{"$f":"COUNTIF(F176:F220,\"P\")","v":0},"Perempuan",null,"15 Th",{"$f":"+K222/$F$52*100%","v":0},{"$f":"COUNTIF(K176:K220,\"15\")","v":0},null,"PEG / KARY. SWASTA",null,null,null,null,null,null,"MTs",13,"Katolik",0,null,null,{"$f":"+INPUT!$J$9","v":"Penata Muda"}]
[null,null,null,null,null,{"$f":"SUM(F221:F222)","v":1},"Total Siswa",null,"16 Th",{"$f":"+K223/$F$52*100%","v":1},{"$f":"COUNTIF(K176:K220,\"16\")","v":1},null,"PNS",null,null,null,null,null,null,"Lainnya",33,"Protestan",0,null,null,{"$f":"+INPUT!$J$9","v":"Penata Muda"}]
[null,null,null,null,null,null,null,null,"17 Th",0,{"$f":"COUNTIF(K176:K220,\"17\")","v":0},null,"WIRASWASTA",null,null,null,null,null,null,null,null,"Hindu",0,null,null,{"$f":"+INPUT!$J$9","v":"Penata Muda"}]
[null,null,null,null,null,null,null,null,"18 Th",0,{"$f":"COUNTIF(K176:K220,\"18\")","v":0},null,"KARY/ PEGAWAI .BUMN",null,null,null,null,null,null,null,null,"Budha",0,null,null,{"$f":"+INPUT!$J$9","v":"Penata Muda"}]
[null,null,null,null,null,null,null,null,"19 Th",0,{"$f":"COUNTIF(K176:K220,\"19\")","v":0},null,"KEPOLISIAN",null,null,null,null,null,null,null,null,null,33,null,null,{"$f":"+INPUT!$J$9","v":"Penata Muda"}]
[null,null,null,null,null,null,null,null,"20 Th",0,{"$f":"COUNTIF(K176:K220,\"20\")","v":0},null,"PENSIUNAN",null,null,null,null,null,null,null,null,null,null,null,null,{"$f":"+INPUT!$J$9","v":"Penata Muda"}]
[null,null,null,null,null,null,null,null,"TOTAL",1,{"$f":"SUM(K221:K227)","v":1},null,"HONORER",null,null,null,null,null,null,null,null,null,null,null,null,{"$f":"+INPUT!$J$9","v":"Penata Muda"}]
[null,null,null,null,null,null,null,null,null,null,null,null,"GURU",null,null,null,null,null,null,null,null,null,null,null,null,{"$f":"+INPUT!$J$9","v":"Penata Muda"}]
[null,null,null,null,null,null,null,null,null,null,null,null,"TAK ADA DATA",null,null,null,null,null,null,null,null,null,null,null,null,{"$f":"+INPUT!$J$9","v":"Penata Muda"}]
[null,null,null,null,null,null,null,null,null,null,null,null,"TOTAL DATA",null,null,null,null,null,null,null,null,null,null,null,null,{"$f":"+INPUT!$J$9","v":"Penata Muda"}]
[null,{"$f":"MAX(A176:A220)","v":180},null,null,null,null,null,null,null,null,null,null,null,null,null,null,null,null,null,null,null,null,null,null,null,{"$f":"+INPUT!$J$9","v":"Penata Muda"}]
[{"$f":"+$B$232+1","v":181},{"$f":"+INPUT!$H$10","v":"XI IPS-2"},"AGUS RAHAYU",12130039,"9970454708","P","SERANG","1997-08-17",{"$f":"TODAY()","v":"2013-07-24"},{"$f":"+$J$3","v":2013},{"$f":"IF(H233=\"\",\"\",DATEDIF(H233,I233,\"y\"))","v":15},null,null,null,null,null,null,null,null,null,null,null,null,null,{"$f":"+INPUT!$I$10","v":"Arie Septiningrum,S.Pd"},{"$f":"+INPUT!$J$10","v":"Penata Muda"},null,null,null,{"$f":"+B233","v":"XI IPS-2"}]
[{"$f":"+A233+1","v":182},{"$f":"IF(A234=0,\" \",+B233)","v":"XI IPS-2"},null,null,null,null,null,null,{"$f":"TODAY()","v":"2013-07-24"},2013,{"$f":"IF(H234=\"\",\"\",DATEDIF(H234,I234,\"y\"))","v":""},null,null,null,null,null,null,null,null,null,null,null,null,null,{"$f":"+INPUT!$I$10","v":"Arie Septiningrum,S.Pd"},{"$f":"+INPUT!$J$10","v":"Penata Muda"}]
[{"$f":"+A234+1","v":183},{"$f":"IF(A235=0,\" \",+B234)","v":"XI IPS-2"},null,null,null,null,null,null,"2013-07-24",2013,"",null,null,null,null,null,null,null,null,null,null,null,null,null,{"$f":"+INPUT!$I$10","v":"Arie Septiningrum,S.Pd"},{"$f":"+INPUT!$J$10","v":"Penata Muda"}]
[184,{"$f":"IF(A236=0,\" \",+B235)","v":"XI IPS-2"},null,null,null,null,null,null,"2013-07-24",2013,"",null,null,null,null,null,null,null,null,null,null,null,null,null,{"$f":"+INPUT!$I$10","v":"Arie Septiningrum,S.Pd"},{"$f":"+INPUT!$J$10","v":"Penata Muda"}]
[185,"XI IPS-2",null,null,null,null,null,null,"2013-07-24",2013,"",null,null,null,null,null,null,null,null,null,null,null,null,null,{"$f":"+INPUT!$I$10","v":"Arie Septiningrum,S.Pd"},{"$f":"+INPUT!$J$10","v":"Penata Muda"}]
[186,"XI IPS-2",null,null,null,null,null,null,"2013-07-24",2013,"",null,null,null,null,null,null,null,null,null,null,null,null,null,{"$f":"+INPUT!$I$10","v":"Arie Septiningrum,S.Pd"},{"$f":"+INPUT!$J$10","v":"Penata Muda"}]
[187,"XI IPS-2",null,null,null,null,null,null,"2013-07-24",2013,"",null,null,null,null,null,null,null,null,null,null,null,null,null,{"$f":"+INPUT!$I$10","v":"Arie Septiningrum,S.Pd"},{"$f":"+INPUT!$J$10","v":"Penata Muda"}]
[188,"XI IPS-2",null,null,null,null,null,null,"2013-07-24",2013,"",null,null,null,null,null,null,null,null,null,null,null,null,null,{"$f":"+INPUT!$I$10","v":"Arie Septiningrum,S.Pd"},{"$f":"+INPUT!$J$10","v":"Penata Muda"}]
[189,"XI IPS-2",null,null,null,null,null,null,"2013-07-24",2013,"",null,null,null,null,null,null,null,null,null,null,null,null,null,{"$f":"+INPUT!$I$10","v":"Arie Septiningrum,S.Pd"},{"$f":"+INPUT!$J$10","v":"Penata Muda"}]
[190,"XI IPS-2",null,null,null,null,null,null,"2013-07-24",2013,"",null,null,null,null,null,null,null,null,null,null,null,null,null,{"$f":"+INPUT!$I$10","v":"Arie Septiningrum,S.Pd"},{"$f":"+INPUT!$J$10","v":"Penata Muda"}]
[191,"XI IPS-2",null,null,null,null,null,null,"2013-07-24",2013,"",null,null,null,null,null,null,null,null,null,null,null,null,null,{"$f":"+INPUT!$I$10","v":"Arie Septiningrum,S.Pd"},{"$f":"+INPUT!$J$10","v":"Penata Muda"}]
[192,"XI IPS-2",null,null,null,null,null,null,"2013-07-24",2013,"",null,null,null,null,null,null,null,null,null,null,null,null,null,{"$f":"+INPUT!$I$10","v":"Arie Septiningrum,S.Pd"},{"$f":"+INPUT!$J$10","v":"Penata Muda"}]
[193,"XI IPS-2",null,null,null,null,null,null,"2013-07-24",2013,"",null,null,null,null,null,null,null,null,null,null,null,null,null,{"$f":"+INPUT!$I$10","v":"Arie Septiningrum,S.Pd"},{"$f":"+INPUT!$J$10","v":"Penata Muda"}]
[194,"XI IPS-2",null,null,null,null,null,null,"2013-07-24",2013,"",null,null,null,null,null,null,null,null,null,null,null,null,null,{"$f":"+INPUT!$I$10","v":"Arie Septiningrum,S.Pd"},{"$f":"+INPUT!$J$10","v":"Penata Muda"}]
[195,"XI IPS-2",null,null,null,null,null,null,"2013-07-24",2013,"",null,null,null,null,null,null,null,null,null,null,null,null,null,{"$f":"+INPUT!$I$10","v":"Arie Septiningrum,S.Pd"},{"$f":"+INPUT!$J$10","v":"Penata Muda"}]
[196,"XI IPS-2",null,null,null,null,null,null,"2013-07-24",2013,"",null,null,null,null,null,null,null,null,null,null,null,null,null,{"$f":"+INPUT!$I$10","v":"Arie Septiningrum,S.Pd"},{"$f":"+INPUT!$J$10","v":"Penata Muda"}]
[197,"XI IPS-2",null,null,null,null,null,null,"2013-07-24",2013,"",null,null,null,null,null,null,null,null,null,null,null,null,null,{"$f":"+INPUT!$I$10","v":"Arie Septiningrum,S.Pd"},{"$f":"+INPUT!$J$10","v":"Penata Muda"}]
[198,"XI IPS-2",null,null,null,null,null,null,"2013-07-24",2013,"",null,null,null,null,null,null,null,null,null,null,null,null,null,{"$f":"+INPUT!$I$10","v":"Arie Septiningrum,S.Pd"},{"$f":"+INPUT!$J$10","v":"Penata Muda"}]
[199,"XI IPS-2",null,null,null,null,null,null,"2013-07-24",2013,"",null,null,null,null,null,null,null,null,null,null,null,null,null,{"$f":"+INPUT!$I$10","v":"Arie Septiningrum,S.Pd"},{"$f":"+INPUT!$J$10","v":"Penata Muda"}]
[200,"XI IPS-2",null,null,null,null,null,null,"2013-07-24",2013,"",null,null,null,null,null,null,null,null,null,null,null,null,null,{"$f":"+INPUT!$I$10","v":"Arie Septiningrum,S.Pd"},{"$f":"+INPUT!$J$10","v":"Penata Muda"}]
[201,"XI IPS-2",null,null,null,null,null,null,"2013-07-24",2013,"",null,null,null,null,null,null,null,null,null,null,null,null,null,{"$f":"+INPUT!$I$10","v":"Arie Septiningrum,S.Pd"},{"$f":"+INPUT!$J$10","v":"Penata Muda"}]
[202,"XI IPS-2",null,null,null,null,null,null,"2013-07-24",2013,"",null,null,null,null,null,null,null,null,null,null,null,null,null,{"$f":"+INPUT!$I$10","v":"Arie Septiningrum,S.Pd"},{"$f":"+INPUT!$J$10","v":"Penata Muda"}]
[203,"XI IPS-2",null,null,null,null,null,null,"2013-07-24",2013,"",null,null,null,null,null,null,null,null,null,null,null,null,null,{"$f":"+INPUT!$I$10","v":"Arie Septiningrum,S.Pd"},{"$f":"+INPUT!$J$10","v":"Penata Muda"}]
[204,"XI IPS-2",null,null,null,null,null,null,"2013-07-24",2013,"",null,null,null,null,null,null,null,null,null,null,null,null,null,{"$f":"+INPUT!$I$10","v":"Arie Septiningrum,S.Pd"},{"$f":"+INPUT!$J$10","v":"Penata Muda"}]
[205,"XI IPS-2",null,null,null,null,null,null,"2013-07-24",2013,"",null,null,null,null,null,null,null,null,null,null,null,null,null,{"$f":"+INPUT!$I$10","v":"Arie Septiningrum,S.Pd"},{"$f":"+INPUT!$J$10","v":"Penata Muda"}]
[206,"XI IPS-2",null,null,null,null,null,null,"2013-07-24",2013,"",null,null,null,null,null,null,null,null,null,null,null,null,null,{"$f":"+INPUT!$I$10","v":"Arie Septiningrum,S.Pd"},{"$f":"+INPUT!$J$10","v":"Penata Muda"}]
[207,"XI IPS-2",null,null,null,null,null,null,"2013-07-24",2013,"",null,null,null,null,null,null,null,null,null,null,null,null,null,{"$f":"+INPUT!$I$10","v":"Arie Septiningrum,S.Pd"},{"$f":"+INPUT!$J$10","v":"Penata Muda"}]
[208,"XI IPS-2",null,null,null,null,null,null,"2013-07-24",2013,"",null,null,null,null,null,null,null,null,null,null,null,null,null,{"$f":"+INPUT!$I$10","v":"Arie Septiningrum,S.Pd"},{"$f":"+INPUT!$J$10","v":"Penata Muda"}]
[209,"XI IPS-2",null,null,null,null,null,null,"2013-07-24",2013,"",null,null,null,null,null,null,null,null,null,null,null,null,null,{"$f":"+INPUT!$I$10","v":"Arie Septiningrum,S.Pd"},{"$f":"+INPUT!$J$10","v":"Penata Muda"}]
[210,"XI IPS-2",null,null,null,null,null,null,"2013-07-24",2013,"",null,null,null,null,null,null,null,null,null,null,null,null,null,{"$f":"+INPUT!$I$10","v":"Arie Septiningrum,S.Pd"},{"$f":"+INPUT!$J$10","v":"Penata Muda"}]
[211,"XI IPS-2",null,null,null,null,null,null,"2013-07-24",2013,"",null,null,null,null,null,null,null,null,null,null,null,null,null,{"$f":"+INPUT!$I$10","v":"Arie Septiningrum,S.Pd"},{"$f":"+INPUT!$J$10","v":"Penata Muda"}]
[212,"XI IPS-2",null,null,null,null,null,null,"2013-07-24",2013,"",null,null,null,null,null,null,null,null,null,null,null,null,null,{"$f":"+INPUT!$I$10","v":"Arie Septiningrum,S.Pd"},{"$f":"+INPUT!$J$10","v":"Penata Muda"}]
[213,"XI IPS-2",null,null,null,null,null,null,"2013-07-24",2013,"",null,null,null,null,null,null,null,null,null,null,null,null,null,{"$f":"+INPUT!$I$10","v":"Arie Septiningrum,S.Pd"},{"$f":"+INPUT!$J$10","v":"Penata Muda"}]
[214,"XI IPS-2",null,null,null,null,null,null,"2013-07-24",2013,"",null,null,null,null,null,null,null,null,null,null,null,null,null,{"$f":"+INPUT!$I$10","v":"Arie Septiningrum,S.Pd"},{"$f":"+INPUT!$J$10","v":"Penata Muda"}]
[215,"XI IPS-2",null,null,null,null,null,null,"2013-07-24",2013,"",null,null,null,null,null,null,null,null,null,null,null,null,null,{"$f":"+INPUT!$I$10","v":"Arie Septiningrum,S.Pd"},{"$f":"+INPUT!$J$10","v":"Penata Muda"}]
[216,"XI IPS-2",null,null,null,null,null,null,"2013-07-24",2013,"",null,null,null,null,null,null,null,null,null,null,null,null,null,{"$f":"+INPUT!$I$10","v":"Arie Septiningrum,S.Pd"},{"$f":"+INPUT!$J$10","v":"Penata Muda"}]
[217,"XI IPS-2",null,null,null,null,null,null,"2013-07-24",2013,"",null,null,null,null,null,null,null,null,null,null,null,null,null,{"$f":"+INPUT!$I$10","v":"Arie Septiningrum,S.Pd"},{"$f":"+INPUT!$J$10","v":"Penata Muda"}]
[218,"XI IPS-2",null,null,null,null,null,null,{"$f":"TODAY()","v":"2013-07-24"},2013,"",null,null,null,null,null,null,null,null,null,null,null,null,null,{"$f":"+INPUT!$I$10","v":"Arie Septiningrum,S.Pd"},{"$f":"+INPUT!$J$10","v":"Penata Muda"}]
[219,"XI IPS-2",null,null,null,null,null,null,"2013-07-24",2013,"",null,null,null,null,null,null,null,null,null,null,null,null,null,{"$f":"+INPUT!$I$10","v":"Arie Septiningrum,S.Pd"},{"$f":"+INPUT!$J$10","v":"Penata Muda"}]
[220,"XI IPS-2",null,null,null,null,null,null,"2013-07-24",2013,"",null,null,null,null,null,null,null,null,null,null,null,null,null,{"$f":"+INPUT!$I$10","v":"Arie Septiningrum,S.Pd"},{"$f":"+INPUT!$J$10","v":"Penata Muda"}]
[221,"XI IPS-2",null,null,null,null,null,null,"2013-07-24",2013,"",null,null,null,null,null,null,null,null,null,null,null,null,null,{"$f":"+INPUT!$I$10","v":"Arie Septiningrum,S.Pd"},{"$f":"+INPUT!$J$10","v":"Penata Muda"}]
[222,"XI IPS-2",null,null,null,null,null,null,"2013-07-24",2013,"",null,null,null,null,null,null,null,null,null,null,null,null,null,{"$f":"+INPUT!$I$10","v":"Arie Septiningrum,S.Pd"},{"$f":"+INPUT!$J$10","v":"Penata Muda"}]
[223,"XI IPS-2",null,null,null,null,null,null,"2013-07-24",2013,"",null,null,null,null,null,null,null,null,null,null,null,null,null,{"$f":"+INPUT!$I$10","v":"Arie Septiningrum,S.Pd"},{"$f":"+INPUT!$J$10","v":"Penata Muda"}]
[224,"XI IPS-2",null,null,null,null,null,null,"2013-07-24",2013,"",null,null,null,null,null,null,null,null,null,null,null,null,null,{"$f":"+INPUT!$I$10","v":"Arie Septiningrum,S.Pd"},{"$f":"+INPUT!$J$10","v":"Penata Muda"}]
[225,"XI IPS-2",null,null,null,null,null,null,"2013-07-24",2013,"",null,null,null,null,null,null,null,null,null,null,null,null,null,{"$f":"+INPUT!$I$10","v":"Arie Septiningrum,S.Pd"},{"$f":"+INPUT!$J$10","v":"Penata Muda"}]
[null,null,null,null,null,{"$f":"COUNTIF(F233:F277,\"L\")","v":0},"Laki-laki",null,"14 Th",{"$f":"+K278/$F$52*100%","v":0},{"$f":"COUNTIF(K233:K277,\"14\")","v":0},null,"BURUH HARIAN",null,null,null,null,null,null,"SMP",{"$f":"COUNTIF(U233:U277,\"SMP\")","v":0},"Islam",{"$f":"COUNTIF(W233:W277,\"Islam\")","v":0},null,null,{"$f":"+INPUT!$J$10","v":"Penata Muda"}]
[null,null,null,null,null,{"$f":"COUNTIF(F233:F277,\"P\")","v":1},"Perempuan",null,"15 Th",{"$f":"+K279/$F$52*100%","v":1},{"$f":"COUNTIF(K233:K277,\"15\")","v":1},null,"PEG / KARY. SWASTA",null,null,null,null,null,null,"MTs",{"$f":"COUNTIF(U233:U277,\"MTs\")","v":0},"Katolik",{"$f":"COUNTIF(W233:W277,\"Katolik\")","v":0},null,null,{"$f":"+INPUT!$J$10","v":"Penata Muda"}]
[null,null,null,null,null,{"$f":"SUM(F278:F279)","v":1},"Total Siswa",null,"16 Th",{"$f":"+K280/$F$52*100%","v":0},{"$f":"COUNTIF(K233:K277,\"16\")","v":0},null,"PNS",null,null,null,null,null,null,"Lainnya",{"$f":"+U278+U279","v":0},"Protestan",{"$f":"COUNTIF(W233:W277,\"Protestan\")","v":0},null,null,{"$f":"+INPUT!$J$10","v":"Penata Muda"}]
[null,null,null,null,null,null,null,null,"17 Th",0,{"$f":"COUNTIF(K233:K277,\"17\")","v":0},null,"WIRASWASTA",null,null,null,null,null,null,null,null,"Hindu",{"$f":"COUNTIF(W233:W277,\"Hindu\")","v":0},null,null,{"$f":"+INPUT!$J$10","v":"Penata Muda"}]
[null,null,null,null,null,null,null,null,"18 Th",0,{"$f":"COUNTIF(K233:K277,\"18\")","v":0},null,"KARY/ PEGAWAI .BUMN",null,null,null,null,null,null,null,null,"Budha",{"$f":"COUNTIF(W233:W277,\"Budha\")","v":0},null,null,{"$f":"+INPUT!$J$10","v":"Penata Muda"}]
[null,null,null,null,null,null,null,null,"19 Th",0,{"$f":"COUNTIF(K233:K277,\"19\")","v":0},null,"KEPOLISIAN",null,null,null,null,null,null,null,null,null,{"$f":"SUM(W278:W282)","v":0},null,null,{"$f":"+INPUT!$J$10","v":"Penata Muda"}]
[null,null,null,null,null,null,null,null,"20 Th",0,{"$f":"COUNTIF(K233:K277,\"20\")","v":0},null,"PENSIUNAN",null,null,null,null,null,null,null,null,null,null,null,null,{"$f":"+INPUT!$J$10","v":"Penata Muda"}]
[null,null,null,null,null,null,null,null,"TOTAL",1,{"$f":"SUM(K278:K284)","v":1},null,"HONORER",null,null,null,null,null,null,null,null,null,null,null,null,{"$f":"+INPUT!$J$10","v":"Penata Muda"}]
[null,null,null,null,null,null,null,null,null,null,null,null,"GURU",null,null,null,null,null,null,null,null,null,null,null,null,{"$f":"+INPUT!$J$10","v":"Penata Muda"}]
[null,null,null,null,null,null,null,null,null,null,null,null,"TAK ADA DATA",null,null,null,null,null,null,null,null,null,null,null,null,{"$f":"+INPUT!$J$10","v":"Penata Muda"}]
[null,null,null,null,null,null,null,null,null,null,null,null,"TOTAL DATA",null,null,null,null,null,null,null,null,null,null,null,null,{"$f":"+INPUT!$J$10","v":"Penata Muda"}]
[null,{"$f":"MAX(A233:A277)","v":225},null,null,null,null,null,null,null,null,null,null,null,null,null,null,null,null,null,null,null,null,null,null,null,{"$f":"+INPUT!$J$10","v":"Penata Muda"}]
[{"$f":"+$B$289+1","v":226},{"$f":"+INPUT!$H$11","v":"XI IPS-3"},"ABDUL WAHID",12130003,"9965299861","L","CILEGON","1996-09-05",{"$f":"TODAY()","v":"2013-07-24"},{"$f":"+$J$3","v":2013},{"$f":"IF(H290=\"\",\"\",DATEDIF(H290,I290,\"y\"))","v":16},null,null,null,null,null,null,null,null,null,null,null,null,null,{"$f":"+INPUT!$I$11","v":"Toyyibah,M.Pd"},{"$f":"+INPUT!$J$11","v":"Guru Madya"},null,null,null,{"$f":"+B290","v":"XI IPS-3"}]
[{"$f":"+A290+1","v":227},{"$f":"IF(A291=0,\" \",+B290)","v":"XI IPS-3"},null,null,null,null,null,null,{"$f":"TODAY()","v":"2013-07-24"},2013,{"$f":"IF(H291=\"\",\"\",DATEDIF(H291,I291,\"y\"))","v":""},null,null,null,null,null,null,null,null,null,null,null,null,null,{"$f":"+INPUT!$I$11","v":"Toyyibah,M.Pd"},{"$f":"+INPUT!$J$11","v":"Guru Madya"}]
[{"$f":"+A291+1","v":228},{"$f":"IF(A292=0,\" \",+B291)","v":"XI IPS-3"},null,null,null,null,null,null,"2013-07-24",2013,"",null,null,null,null,null,null,null,null,null,null,null,null,null,{"$f":"+INPUT!$I$11","v":"Toyyibah,M.Pd"},{"$f":"+INPUT!$J$11","v":"Guru Madya"}]
[229,{"$f":"IF(A293=0,\" \",+B292)","v":"XI IPS-3"},null,null,null,null,null,null,"2013-07-24",2013,"",null,null,null,null,null,null,null,null,null,null,null,null,null,{"$f":"+INPUT!$I$11","v":"Toyyibah,M.Pd"},{"$f":"+INPUT!$J$11","v":"Guru Madya"}]
[230,"XI IPS-3",null,null,null,null,null,null,"2013-07-24",2013,"",null,null,null,null,null,null,null,null,null,null,null,null,null,{"$f":"+INPUT!$I$11","v":"Toyyibah,M.Pd"},{"$f":"+INPUT!$J$11","v":"Guru Madya"}]
[231,"XI IPS-3",null,null,null,null,null,null,"2013-07-24",2013,"",null,null,null,null,null,null,null,null,null,null,null,null,null,{"$f":"+INPUT!$I$11","v":"Toyyibah,M.Pd"},{"$f":"+INPUT!$J$11","v":"Guru Madya"}]
[232,"XI IPS-3",null,null,null,null,null,null,"2013-07-24",2013,"",null,null,null,null,null,null,null,null,null,null,null,null,null,{"$f":"+INPUT!$I$11","v":"Toyyibah,M.Pd"},{"$f":"+INPUT!$J$11","v":"Guru Madya"}]
[233,"XI IPS-3",null,null,null,null,null,null,"2013-07-24",2013,"",null,null,null,null,null,null,null,null,null,null,null,null,null,{"$f":"+INPUT!$I$11","v":"Toyyibah,M.Pd"},{"$f":"+INPUT!$J$11","v":"Guru Madya"}]
[234,"XI IPS-3",null,null,null,null,null,null,"2013-07-24",2013,"",null,null,null,null,null,null,null,null,null,null,null,null,null,{"$f":"+INPUT!$I$11","v":"Toyyibah,M.Pd"},{"$f":"+INPUT!$J$11","v":"Guru Madya"}]
[235,"XI IPS-3",null,null,null,null,null,null,"2013-07-24",2013,"",null,null,null,null,null,null,null,null,null,null,null,null,null,{"$f":"+INPUT!$I$11","v":"Toyyibah,M.Pd"},{"$f":"+INPUT!$J$11","v":"Guru Madya"}]
[236,"XI IPS-3",null,null,null,null,null,null,"2013-07-24",2013,"",null,null,null,null,null,null,null,null,null,null,null,null,null,{"$f":"+INPUT!$I$11","v":"Toyyibah,M.Pd"},{"$f":"+INPUT!$J$11","v":"Guru Madya"}]
[237,"XI IPS-3",null,null,null,null,null,null,"2013-07-24",2013,"",null,null,null,null,null,null,null,null,null,null,null,null,null,{"$f":"+INPUT!$I$11","v":"Toyyibah,M.Pd"},{"$f":"+INPUT!$J$11","v":"Guru Madya"}]
[238,"XI IPS-3",null,null,null,null,null,null,"2013-07-24",2013,"",null,null,null,null,null,null,null,null,null,null,null,null,null,{"$f":"+INPUT!$I$11","v":"Toyyibah,M.Pd"},{"$f":"+INPUT!$J$11","v":"Guru Madya"}]
[239,"XI IPS-3",null,null,null,null,null,null,"2013-07-24",2013,"",null,null,null,null,null,null,null,null,null,null,null,null,null,{"$f":"+INPUT!$I$11","v":"Toyyibah,M.Pd"},{"$f":"+INPUT!$J$11","v":"Guru Madya"}]
[240,"XI IPS-3",null,null,null,null,null,null,"2013-07-24",2013,"",null,null,null,null,null,null,null,null,null,null,null,null,null,{"$f":"+INPUT!$I$11","v":"Toyyibah,M.Pd"},{"$f":"+INPUT!$J$11","v":"Guru Madya"}]
[241,"XI IPS-3",null,null,null,null,null,null,"2013-07-24",2013,"",null,null,null,null,null,null,null,null,null,null,null,null,null,{"$f":"+INPUT!$I$11","v":"Toyyibah,M.Pd"},{"$f":"+INPUT!$J$11","v":"Guru Madya"}]
[242,"XI IPS-3",null,null,null,null,null,null,"2013-07-24",2013,"",null,null,null,null,null,null,null,null,null,null,null,null,null,{"$f":"+INPUT!$I$11","v":"Toyyibah,M.Pd"},{"$f":"+INPUT!$J$11","v":"Guru Madya"}]
[243,"XI IPS-3",null,null,null,null,null,null,"2013-07-24",2013,"",null,null,null,null,null,null,null,null,null,null,null,null,null,{"$f":"+INPUT!$I$11","v":"Toyyibah,M.Pd"},{"$f":"+INPUT!$J$11","v":"Guru Madya"}]
[244,"XI IPS-3",null,null,null,null,null,null,"2013-07-24",2013,"",null,null,null,null,null,null,null,null,null,null,null,null,null,{"$f":"+INPUT!$I$11","v":"Toyyibah,M.Pd"},{"$f":"+INPUT!$J$11","v":"Guru Madya"}]
[245,"XI IPS-3",null,null,null,null,null,null,"2013-07-24",2013,"",null,null,null,null,null,null,null,null,null,null,null,null,null,{"$f":"+INPUT!$I$11","v":"Toyyibah,M.Pd"},{"$f":"+INPUT!$J$11","v":"Guru Madya"}]
[246,"XI IPS-3",null,null,null,null,null,null,"2013-07-24",2013,"",null,null,null,null,null,null,null,null,null,null,null,null,null,{"$f":"+INPUT!$I$11","v":"Toyyibah,M.Pd"},{"$f":"+INPUT!$J$11","v":"Guru Madya"}]
[247,"XI IPS-3",null,null,null,null,null,null,"2013-07-24",2013,"",null,null,null,null,null,null,null,null,null,null,null,null,null,{"$f":"+INPUT!$I$11","v":"Toyyibah,M.Pd"},{"$f":"+INPUT!$J$11","v":"Guru Madya"}]
[248,"XI IPS-3",null,null,null,null,null,null,"2013-07-24",2013,"",null,null,null,null,null,null,null,null,null,null,null,null,null,{"$f":"+INPUT!$I$11","v":"Toyyibah,M.Pd"},{"$f":"+INPUT!$J$11","v":"Guru Madya"}]
[249,"XI IPS-3",null,null,null,null,null,null,"2013-07-24",2013,"",null,null,null,null,null,null,null,null,null,null,null,null,null,{"$f":"+INPUT!$I$11","v":"Toyyibah,M.Pd"},{"$f":"+INPUT!$J$11","v":"Guru Madya"}]
[250,"XI IPS-3",null,null,null,null,null,null,"2013-07-24",2013,"",null,null,null,null,null,null,null,null,null,null,null,null,null,{"$f":"+INPUT!$I$11","v":"Toyyibah,M.Pd"},{"$f":"+INPUT!$J$11","v":"Guru Madya"}]
[251,"XI IPS-3",null,null,null,null,null,null,"2013-07-24",2013,"",null,null,null,null,null,null,null,null,null,null,null,null,null,{"$f":"+INPUT!$I$11","v":"Toyyibah,M.Pd"},{"$f":"+INPUT!$J$11","v":"Guru Madya"}]
[252,"XI IPS-3",null,null,null,null,null,null,"2013-07-24",2013,"",null,null,null,null,null,null,null,null,null,null,null,null,null,{"$f":"+INPUT!$I$11","v":"Toyyibah,M.Pd"},{"$f":"+INPUT!$J$11","v":"Guru Madya"}]
[253,"XI IPS-3",null,null,null,null,null,null,"2013-07-24",2013,"",null,null,null,null,null,null,null,null,null,null,null,null,null,{"$f":"+INPUT!$I$11","v":"Toyyibah,M.Pd"},{"$f":"+INPUT!$J$11","v":"Guru Madya"}]
[254,"XI IPS-3",null,null,null,null,null,null,"2013-07-24",2013,"",null,null,null,null,null,null,null,null,null,null,null,null,null,{"$f":"+INPUT!$I$11","v":"Toyyibah,M.Pd"},{"$f":"+INPUT!$J$11","v":"Guru Madya"}]
[255,"XI IPS-3",null,null,null,null,null,null,"2013-07-24",2013,"",null,null,null,null,null,null,null,null,null,null,null,null,"SRI SETYANINGSIH",{"$f":"+INPUT!$I$11","v":"Toyyibah,M.Pd"},{"$f":"+INPUT!$J$11","v":"Guru Madya"}]
[256,"XI IPS-3",null,null,null,null,null,null,"2013-07-24",2013,"",null,null,null,null,null,null,null,null,null,null,null,null,null,{"$f":"+INPUT!$I$11","v":"Toyyibah,M.Pd"},{"$f":"+INPUT!$J$11","v":"Guru Madya"}]
[257,"XI IPS-3",null,null,null,null,null,null,"2013-07-24",2013,"",null,null,null,null,null,null,null,null,null,null,null,null,null,{"$f":"+INPUT!$I$11","v":"Toyyibah,M.Pd"},{"$f":"+INPUT!$J$11","v":"Guru Madya"}]
[258,"XI IPS-3",null,null,null,null,null,null,"2013-07-24",2013,"",null,null,null,null,null,null,null,null,null,null,null,null,null,{"$f":"+INPUT!$I$11","v":"Toyyibah,M.Pd"},{"$f":"+INPUT!$J$11","v":"Guru Madya"}]
[259,"XI IPS-3",null,null,null,null,null,null,"2013-07-24",2013,"",null,null,null,null,null,null,null,null,null,null,null,null,null,{"$f":"+INPUT!$I$11","v":"Toyyibah,M.Pd"},{"$f":"+INPUT!$J$11","v":"Guru Madya"}]
[260,"XI IPS-3",null,null,null,null,null,null,"2013-07-24",2013,"",null,null,null,null,null,null,null,null,null,null,null,null,"ASNAWATI",{"$f":"+INPUT!$I$11","v":"Toyyibah,M.Pd"},{"$f":"+INPUT!$J$11","v":"Guru Madya"}]
[261,"XI IPS-3",null,null,null,null,null,null,"2013-07-24",2013,"",null,null,null,null,null,null,null,null,null,null,null,null,null,{"$f":"+INPUT!$I$11","v":"Toyyibah,M.Pd"},{"$f":"+INPUT!$J$11","v":"Guru Madya"}]
[262,"XI IPS-3",null,null,null,null,null,null,"2013-07-24",2013,"",null,null,null,null,null,null,null,null,null,null,null,null,null,{"$f":"+INPUT!$I$11","v":"Toyyibah,M.Pd"},{"$f":"+INPUT!$J$11","v":"Guru Madya"}]
[263,"XI IPS-3",null,null,null,null,null,null,{"$f":"TODAY()","v":"2013-07-24"},2013,"",null,null,null,null,null,null,null,null,null,null,null,null,null,{"$f":"+INPUT!$I$11","v":"Toyyibah,M.Pd"},{"$f":"+INPUT!$J$11","v":"Guru Madya"}]
[264,"XI IPS-3",null,null,null,null,null,null,"2013-07-24",2013,"",null,null,null,null,null,null,null,null,null,null,null,null,null,{"$f":"+INPUT!$I$11","v":"Toyyibah,M.Pd"},{"$f":"+INPUT!$J$11","v":"Guru Madya"}]
[265,"XI IPS-3",null,null,null,null,null,null,"2013-07-24",2013,"",null,null,null,null,null,null,null,null,null,null,null,null,null,{"$f":"+INPUT!$I$11","v":"Toyyibah,M.Pd"},{"$f":"+INPUT!$J$11","v":"Guru Madya"}]
[266,"XI IPS-3",null,null,null,null,null,null,"2013-07-24",2013,"",null,null,null,null,null,null,null,null,null,null,null,null,null,{"$f":"+INPUT!$I$11","v":"Toyyibah,M.Pd"},{"$f":"+INPUT!$J$11","v":"Guru Madya"}]
[267,"XI IPS-3",null,null,null,null,null,null,"2013-07-24",2013,"",null,null,null,null,null,null,null,null,null,null,null,null,null,{"$f":"+INPUT!$I$11","v":"Toyyibah,M.Pd"},{"$f":"+INPUT!$J$11","v":"Guru Madya"}]
[268,"XI IPS-3",null,null,null,null,null,null,"2013-07-24",2013,"",null,null,null,null,null,null,null,null,null,null,null,null,null,{"$f":"+INPUT!$I$11","v":"Toyyibah,M.Pd"},{"$f":"+INPUT!$J$11","v":"Guru Madya"}]
[269,"XI IPS-3",null,null,null,null,null,null,"2013-07-24",2013,"",null,null,null,null,null,null,null,null,null,null,null,null,null,{"$f":"+INPUT!$I$11","v":"Toyyibah,M.Pd"},{"$f":"+INPUT!$J$11","v":"Guru Madya"}]
[270,"XI IPS-3",null,null,null,null,null,null,"2013-07-24",2013,"",null,null,null,null,null,null,null,null,null,null,null,null,null,{"$f":"+INPUT!$I$11","v":"Toyyibah,M.Pd"},{"$f":"+INPUT!$J$11","v":"Guru Madya"}]
[null,null,null,null,null,{"$f":"COUNTIF(F290:F334,\"L\")","v":1},"Laki-laki",null,"14 Th",{"$f":"+K335/$F$52*100%","v":0},{"$f":"COUNTIF(K290:K334,\"14\")","v":0},null,"BURUH HARIAN",{"$f":"COUNTIF(N290:N334,\"BURUH HARIAN\")","v":0},null,null,null,null,null,"SMP",{"$f":"COUNTIF(U290:U334,\"SMP\")","v":0},"Islam",{"$f":"COUNTIF(W290:W334,\"Islam\")","v":0}]
[null,null,null,null,null,{"$f":"COUNTIF(F290:F334,\"P\")","v":0},"Perempuan",null,"15 Th",{"$f":"+K336/$F$52*100%","v":0},{"$f":"COUNTIF(K290:K334,\"15\")","v":0},null,"PEG / KARY. SWASTA",{"$f":"COUNTIF(N290:N334,\"PEG.SWASTA\")","v":0},null,null,null,null,null,"MTs",{"$f":"COUNTIF(U290:U334,\"MTs\")","v":0},"Katolik",{"$f":"COUNTIF(W290:W334,\"Katolik\")","v":0}]
[null,null,null,null,null,{"$f":"SUM(F335:F336)","v":1},"Total Siswa",null,"16 Th",{"$f":"+K337/$F$52*100%","v":1},{"$f":"COUNTIF(K290:K334,\"16\")","v":1},null,"PNS",{"$f":"COUNTIF(N290:N334,\"PNS\")","v":0},null,null,null,null,null,"Lainnya",{"$f":"+U335+U336","v":0},"Protestan",{"$f":"COUNTIF(W290:W334,\"Protestan\")","v":0}]
[null,null,null,null,null,null,null,null,"17 Th",0,{"$f":"COUNTIF(K290:K334,\"17\")","v":0},null,"WIRASWASTA",{"$f":"COUNTIF(N290:N334,\"WIRASWASTA\")","v":0},null,null,null,null,null,null,null,"Hindu",{"$f":"COUNTIF(W290:W334,\"Hindu\")","v":0}]
[null,null,null,null,null,null,null,null,"18 Th",0,{"$f":"COUNTIF(K290:K334,\"18\")","v":0},null,"KARY/ PEGAWAI .BUMN",{"$f":"COUNTIF(N290:N334,\"PEG/KARY. BUMN\")","v":0},null,null,null,null,null,null,null,"Budha",{"$f":"COUNTIF(W290:W334,\"Budha\")","v":0}]
[null,null,null,null,null,null,null,null,"19 Th",0,{"$f":"COUNTIF(K290:K334,\"19\")","v":0},null,"KEPOLISIAN",{"$f":"COUNTIF(N290:N334,\"KEPOLISIAN\")","v":0},null,null,null,null,null,null,null,null,{"$f":"SUM(W335:W339)","v":0}]
[null,null,null,null,null,null,null,null,"20 Th",0,{"$f":"COUNTIF(K290:K334,\"20\")","v":0},null,"PENSIUNAN",{"$f":"COUNTIF(N290:N334,\"PENSIUNAN\")","v":0}]
[null,null,null,null,null,null,null,null,"TOTAL",1,{"$f":"SUM(K335:K341)","v":1},null,"HONORER",{"$f":"COUNTIF(N290:N334,\"HONORER\")","v":0}]
[null,null,null,null,null,null,null,null,null,null,null,null,"GURU",{"$f":"COUNTIF(N290:N334,\"GURU\")","v":0}]
[null,null,null,null,null,null,null,null,null,null,null,null,"TAK ADA DATA",{"$f":"COUNTIF(N290:N334,\"TAK ADA DATA\")","v":0}]
[null,null,null,null,null,null,null,null,null,null,null,null,"TOTAL DATA",{"$f":"SUM(N335:N344)","v":0}]
[null,{"$f":"MAX(A290:A334)","v":270}]
[]
[]
[null,null,"Data Kosong",{"$f":"COUNTBLANK(D5:D347)","v":337},{"$f":"COUNTBLANK(E5:E347)","v":337},{"$f":"+F50+F107+F164+F221+F278+F335","v":4},"L",null,"14 Th",{"$f":"+K349/$F$351*100%","v":0},{"$f":"+K50+K107+K164+K221+K278+K335","v":0},null,null,null,null,{"$f":"COUNTBLANK(P3:P231)","v":228},{"$f":"COUNTBLANK(Q3:Q231)","v":228},{"$f":"COUNTBLANK(R3:R231)","v":228},null,"SMPN-L",{"$f":"COUNTIF(U5:U347,\"SMPN-L\")","v":0},{"$f":"+U349+U350","v":0},{"$f":"COUNTIF(W3:W347,\"Islam\")","v":2}]
[{"$f":"COUNTA(A5:A334)-1&\"  Siswa\"","v":"269  Siswa"},null,"Data Terisi",{"$f":"COUNTA(D5:D347)","v":6},{"$f":"COUNTA(E5:E347)","v":6},{"$f":"+F51+F108+F165+F222+F279+F336","v":2},"P",null,"15 Th",0.16666666666666666,1,null,{"$f":"COUNTBLANK(M3:M231)","v":183},null,null,"Ijazah lagi",null,"SKHUN lagi",null,"SMP-L",{"$f":"COUNTIF(U5:U347,\"SMP-L\")","v":0},null,{"$f":"COUNTIF(W3:W347,\"Kristen Katolik\")","v":0}]
[null,"KELAS","PENDAPATAN ORANG TUA","AGAMA",null,{"$f":"SUM(F349:F350)","v":6},"Laki-laki & Perempuan",null,"16 Th",0.66666666666666663,4,null,"BURUH HARIAN",{"$f":"COUNTIF(N5:N346,\"BURUH HARIAN\")","v":0},{"$f":"+N351/$F$351*100%","v":0},null,null,null,null,"SMPN-P",{"$f":"COUNTIF(U5:U347,\"SMPN-P\")","v":0},{"$f":"+U351+U352","v":0},{"$f":"COUNTIF(W3:W347,\"Kristen Protestan\")","v":0}]
[null,"X-1","Rp 500 - 700 Ribu","Islam",null,null,null,null,"17 Th",0.16666666666666666,1,null,"PEG / KARY. SWASTA",{"$f":"COUNTIF(N5:N346,\"PEG.SWASTA\")","v":0},{"$f":"+N352/$F$351*100%","v":0},null,null,null,null,"SMP-P",{"$f":"COUNTIF(U5:U347,\"SMP-P\")","v":0},null,{"$f":"COUNTIF(W3:W347,\"Hindu\")","v":0}]
[null,"X-2","Rp 1.000.000 - 1.500.000 Ribu","Katolik",null,null,"LULUSAN",null,"18 Th",0,0,null,"PNS",{"$f":"COUNTIF(N5:N346,\"PNS\")","v":0},0,null,null,null,null,"MTs-L",{"$f":"COUNTIF(U5:U347,\"MTSN-L\")","v":0},{"$f":"+U353+U354","v":0},{"$f":"COUNTIF(W3:W347,\"Budha\")","v":0}]
[null,"X-3","Rp 2.000.000 -2500.000 Ribu","Protestan",null,null,"SMP",null,"19 Th",0,0,null,"WIRASWASTA",{"$f":"COUNTIF(N5:N346,\"WIRASWASTA\")","v":0},0,null,null,null,null,"MTSN-L",{"$f":"COUNTIF(U5:U347,\"MTS-L\")","v":0},null,{"$f":"SUM(W349:W353)","v":2}]
[null,"X-4","Rp 3000.000 -Ke atas","Hindu",null,null,"MTS",null,"20 Th",0,0,null,"KARY/ PEGAWAI .BUMN",{"$f":"COUNTIF(N5:N346,\"PEG/KARY. BUMN\")","v":0},0,null,null,null,null,"MTs-P",{"$f":"COUNTIF(U5:U347,\"MTSN-P\")","v":0},{"$f":"+U355+U356","v":0}]
[null,"X-5",null,"Budha",null,null,"Lainnya",null,"TOTAL",{"$f":"SUM(J349:J355)","v":0.99999999999999989},{"$f":"SUM(K349:K355)","v":6},null,"KEPOLISIAN",{"$f":"COUNTIF(N5:N346,\"KEPOLISIAN\")","v":0},0,null,null,null,null,"MTSN-P",{"$f":"COUNTIF(U5:U347,\"MTS-P\")","v":0}]
[null,"X-6","ASAL SEKOLAH",null,null,null,null,null,null,null,null,null,"PENSIUNAN",{"$f":"COUNTIF(N5:N346,\"PENSIUNAN\")","v":0},0,null,null,null,null,null,{"$f":"SUM(U349:U356)","v":0}]
[null,"XI-IPA 1","SMPN 1 CILEGON",null,null,null,null,null,null,null,null,null,"HONORER",{"$f":"COUNTIF(N5:N346,\"HONORER\")","v":0},0]
[null,"XI-IPA 2","SMPN 2 CILEGON",null,null,null,null,null,null,null,null,null,"GURU",{"$f":"COUNTIF(N5:N346,\"GURU\")","v":0},0]
[null,"XI-IPA 3","SMPN 3 CILEGON",null,null,null,null,null,null,null,null,null,"TAK ADA DATA",{"$f":"COUNTIF(N5:N346,\"TAK ADA DATA\")","v":0},0]
[null,"XI-IPS 1","SMPN 4 CILEGON"]
[null,"XI-IPS 2","SMPN 5 CILEGON",null,null,null,null,null,null,null,null,null,"TOTAL DATA",{"$f":"SUM(N351:N361)&\" Orang\"","v":"0 Orang"},{"$f":"SUM(O351:O360)","v":0}]
[null,"XI-IPS 3","SMPN 6 CILEGON"]
[null,"XII-IPA 1","SMPN 7 CILEGON"]
[null,"XII-IPA 2","SMPN 8 CILEGON"]
[null,"XII-IPA 3","SMPN 9 CILEGON"]
[null,"XII-IPS 1","SMPN 10 CILEGON"]
[null,"XII-IPS 2","SMPN 11 CILEGON"]
[null,"XII-IPS 3","SMP MADINATUL HADIED"]
[null,null,"SMP 17 CLG"]
[null,null,"SMP AL-ISHLAH"]
[null,null,"SMP Daar El Falaah"]
[null,null,"SMP FATAHILAH"]
[null,null,"SMP KS"]
[null,null,"SMP MARDIYUANA "]
[null,null,"SMP MUHAMADIYAH TALANGPADANG"]
[null,null,"SMP MUHAMMADIYAH CILEGON"]
[null,null,"SMP NUR EL FALAH"]
[null,null,"SMP PGRI 2 CITANGKIL"]
[null,null,"SMP RAUDATHUL JANNAH"]
[null,null,"SMP YAPMU"]
[null,null,"SMPN 1 ANYAR"]
[null,null,"SMPN 1 CIPANAS"]
[null,null,"SMPN 1 KALIANDA"]
[null,null,"SMPN 1 MANCAK"]
[null,null,"SMPN 2 ABUNG TINGGI"]
[null,null,"SMPN 2 MANCAK"]
[null,null,"SMPN 3 RAMBATAN"]
[null,null,"MTS AL-BUSTANIYAH"]
[null,null,"MTS AL-BUSTANIYAH"]
[null,null,"MTS AL-HASYIMIYAH"]
[null,null,"MTS AL-HIDAYAH"]
[null,null,"MTS AL-I'ANAH"]
[null,null,"MTS AL-INAYAH"]
[null,null,"MTS AL-ITMAM"]
[null,null,"MTS AL-JAUHAROTUNNAQIYYAH PALAS"]
[null,null,"MTS AL-KH PABUARAN"]
[null,null,"MTS AL-KH PEKALONGAN"]
[null,null,"MTS AL-KHAIRIYAH CITANGKIL"]
[null,null,"MTS AL-KHAIRIYAH KOTA SARI"]
[null,null,"MTS AL-KHAIRIYAH KUBANGSARI"]
[null,null,"MTS ALKH-KRACAK"]
[null,null,"MTS BANI NAWAI"]
[null,null,"MTS DARUSYSYIFA"]
[null,null,"MTS HIKMATUL ULUM"]
[null,null,"MTs MATHLAUL FALAH"]
[null,null,"MTS NURUL KALAM"]
[null,null,"MTS TANGERANG"]
[null,null,"MTS TANGERANG"]
[null,null,"MTSN ANYAR"]
[null,null,"MTSN CILEGON"]
[null,null,"MTSN CIWANDAN"]
[null,null,"LAINNYA"]
[null,null,null,null,null,null,null,null,null,null,null,"Wanita 13",{"$f":"SUMPRODUCT(($F$5:$F$334=\"P\")*($K$5:$K$334=13))","v":0}]
[null,null,null,null,null,null,null,null,null,null,null,"Pria 13",{"$f":"SUMPRODUCT(($F$5:$F$334=\"L\")*($K$5:$K$334=13))","v":0}]
[null,null,null,null,null,null,null,null,null,null,null,"Wanita 14",{"$f":"SUMPRODUCT(($F$5:$F$334=\"P\")*($K$5:$K$334=14))","v":0}]
[null,null,null,null,null,null,null,null,null,null,null,"Pria 14",{"$f":"SUMPRODUCT(($F$5:$F$334=\"L\")*($K$5:$K$334=14))","v":0}]
[null,null,null,null,null,null,null,null,null,null,null,"Wanita 15",{"$f":"SUMPRODUCT(($F$5:$F$334=\"P\")*($K$5:$K$334=15))","v":1}]
[null,null,null,null,null,null,null,null,null,null,null,"Pria 15",{"$f":"SUMPRODUCT(($F$5:$F$334=\"L\")*($K$5:$K$334=15))","v":0}]
[null,null,null,null,null,null,null,null,null,null,null,"Wanita 16",{"$f":"SUMPRODUCT(($F$5:$F$334=\"P\")*($K$5:$K$334=16))","v":0}]
[null,null,null,null,null,null,null,null,null,null,null,"Pria 16",{"$f":"SUMPRODUCT(($F$5:$F$334=\"L\")*($K$5:$K$334=16))","v":4}]
[null,null,null,null,null,null,null,null,null,null,null,"Wanita 17",{"$f":"SUMPRODUCT(($F$5:$F$334=\"P\")*($K$5:$K$334=17))","v":1}]
[null,null,null,null,null,null,null,null,null,null,null,"Pria 17",{"$f":"SUMPRODUCT(($F$5:$F$334=\"L\")*($K$5:$K$334=17))","v":0}]
[null,null,null,null,null,null,null,null,null,null,null,"Wanita 18",{"$f":"SUMPRODUCT(($F$5:$F$334=\"P\")*($K$5:$K$334=18))","v":0}]
[null,null,null,null,null,null,null,null,null,null,null,"Pria 18",{"$f":"SUMPRODUCT(($F$5:$F$334=\"L\")*($K$5:$K$334=18))","v":0}]
[null,null,null,null,null,null,null,null,null,null,null,"Wanita 19",{"$f":"SUMPRODUCT(($F$5:$F$334=\"P\")*($K$5:$K$334=19))","v":0}]
[null,null,null,null,null,null,null,null,null,null,null,"Pria 19",{"$f":"SUMPRODUCT(($F$5:$F$334=\"L\")*($K$5:$K$334=19))","v":0}]
[null,null,null,null,null,null,null,null,null,null,null,"Wanita 20",{"$f":"SUMPRODUCT(($F$5:$F$334=\"P\")*($K$5:$K$334=20))","v":0}]
[null,null,null,null,null,null,null,null,null,null,null,"Pria 20",{"$f":"SUMPRODUCT(($F$5:$F$334=\"L\")*($K$5:$K$334=20))","v":0}]
[null,null,null,null,null,null,null,null,null,null,null,"Wanita 21",{"$f":"SUMPRODUCT(($F$5:$F$334=\"P\")*($K$5:$K$334=21))","v":0}]
[null,null,null,null,null,null,null,null,null,null,null,"Pria 21",{"$f":"SUMPRODUCT(($F$5:$F$334=\"L\")*($K$5:$K$334=21))","v":0}]
[null,null,null,null,null,null,null,null,null,null,null,"Wanita 22",{"$f":"SUMPRODUCT(($F$5:$F$334=\"P\")*($K$5:$K$334=22))","v":0}]
[null,null,null,null,null,null,null,null,null,null,null,"Pria 22",{"$f":"SUMPRODUCT(($F$5:$F$334=\"L\")*($K$5:$K$334=22))","v":0}]
[null,null,null,null,null,null,null,null,null,null,null,"Wanita 23",{"$f":"SUMPRODUCT(($F$5:$F$334=\"P\")*($K$5:$K$334=23))","v":0}]
[null,null,null,null,null,null,null,null,null,null,null,"Pria 23",{"$f":"SUMPRODUCT(($F$5:$F$334=\"L\")*($K$5:$K$334=23))","v":0}]
[null,null,null,null,null,null,null,null,null,null,null,"Wanita 24",{"$f":"SUMPRODUCT(($F$5:$F$334=\"P\")*($K$5:$K$334=24))","v":0}]
[null,null,null,null,null,null,null,null,null,null,null,"Pria 24",{"$f":"SUMPRODUCT(($F$5:$F$334=\"L\")*($K$5:$K$334=24))","v":0}]
[null,null,null,null,null,null,null,null,null,null,null,"Wanita 25",{"$f":"SUMPRODUCT(($F$5:$F$334=\"P\")*($K$5:$K$334=25))","v":0}]
[null,null,null,null,null,null,null,null,null,null,null,"Pria 25",{"$f":"SUMPRODUCT(($F$5:$F$334=\"L\")*($K$5:$K$334=25))","v":0}]
[null,null,null,null,null,null,null,null,null,null,null,null,{"$f":"SUM(M414:M439)&\"  Siswa \"","v":"6  Siswa "}]

{"sheet":"DataBase-XII","index":5,"n_rows":440,"n_cols":30,"rows_kept":440,"cut":false,"hidden":false,"merged":[[439,12,440,12],[352,21,353,21],[354,21,355,21],[0,8,0,9],[0,26,0,28],[346,0,346,22],[347,0,347,22],[348,21,349,21],[350,21,351,21]]}
["NO","KELAS","NAMA","NIS","NISN","L/P","TMPT LHR","TGL LAHIR","Val",null,"Usia ","NAMA ORANG TUA","PENDAPATAN ORANG TUA","PEKERJAAN ORANG TUA","ALAMAT","NO STTB","NO SKHU","NO PESERTA UJIAN SMP","ASAL SEKOLAH","THN LULUS","SMP/ MTs","NO TELP/HP",null,"NAMA IBU","WALI KELAS","JABATAN","DATA SISWA MUTASI"]
[1,2,3,4,5,6,7,8,9,10,11,12,13,14,15,16,17,18,19,20,21,22,23,24,25,26,"Tanggal Bulan dan Tahun","Kelas dan Semester yang ditinggalkan","Alasan Keluar dan atas permintaan (Tertulis)"]
["Contoh>>","X-1","AAM TAMIMI",12130001,"9970454991","L","CILEGON","1997-05-04",1997,{"$f":"+MENU!$D$6","v":2013},{"$f":"+J3-I3","v":16},"AHYADI","Rp 500 - 700 Ribu","BURUH HARIAN","Jl.Sunan Drajat Link.Cirahap RT 17/02 Ciwandan Cilegon 42444","DN-30 DI 0028823","DN-30 DI 2803800","2-12-30-03-005-139-6","SMPN 4 CILEGON",2012,"SMP","087773100391","Islam",null,null,null,"31/01/2012","X-1 Semester 1","Permintaan Orang Tua "]
["No Urut","PILIH Kls",null,null,null,null,null,null,null,null,null,null,null,null,null,null,null,null,null,null,null,null,null,null,null,null,"2013-01-23","XI-IPA 1 Semester 1","Permintaan Orang Tua "]
[1,{"$f":"+INPUT!$M$6","v":"XII IPA-1"},"ADE ROSIHA",1112077,"9960473779","P","SERANG","1995-12-14",{"$f":"TODAY()","v":"2013-07-24"},{"$f":"+$J$3","v":2013},{"$f":"IF(H5=\"\",\"\",DATEDIF(H5,I5,\"y\"))","v":17},"H. RAHMAT",null,null,"KP CURUG KEPUH DS. BANDENGAN","MTs 300044689","DN-30 DI 0737367","2-11-30-03-036-004-5",null,2011,"MTS","087818193143","Islam",null,{"$f":"+INPUT!$N$6","v":"Dian Misdiyana,S.Pd"},{"$f":"+INPUT!$O$6","v":"Guru Madya"},null,null,null,"XII-IPA-1"]
[2,{"$f":"IF(A6=0,\" \",+B5)","v":"XII IPA-1"},null,null,null,null,null,null,{"$f":"TODAY()","v":"2013-07-24"},2013,{"$f":"IF(H6=\"\",\"\",DATEDIF(H6,I6,\"y\"))","v":""},null,null,null,null,null,null,null,null,null,null,null,null,null,{"$f":"+INPUT!$N$6","v":"Dian Misdiyana,S.Pd"},{"$f":"+INPUT!$O$6","v":"Guru Madya"}]
[3,"XII IPA-1",null,null,null,null,null,null,"2013-07-24",2013,"",null,null,null,null,null,null,null,null,null,null,null,null,null,{"$f":"+INPUT!$N$6","v":"Dian Misdiyana,S.Pd"},{"$f":"+INPUT!$O$6","v":"Guru Madya"}]
[4,"XII IPA-1",null,null,null,null,null,null,"2013-07-24",2013,"",null,null,null,null,null,null,null,null,null,null,null,null,null,{"$f":"+INPUT!$N$6","v":"Dian Misdiyana,S.Pd"},{"$f":"+INPUT!$O$6","v":"Guru Madya"}]
[5,"XII IPA-1",null,null,null,null,null,null,"2013-07-24",2013,"",null,null,null,null,null,null,null,null,null,null,null,null,null,{"$f":"+INPUT!$N$6","v":"Dian Misdiyana,S.Pd"},{"$f":"+INPUT!$O$6","v":"Guru Madya"}]
[6,"XII IPA-1",null,null,null,null,null,null,"2013-07-24",2013,"",null,null,null,null,null,null,null,null,null,null,null,null,null,{"$f":"+INPUT!$N$6","v":"Dian Misdiyana,S.Pd"},{"$f":"+INPUT!$O$6","v":"Guru Madya"}]
[7,"XII IPA-1",null,null,null,null,null,null,"2013-07-24",2013,"",null,null,null,null,null,null,null,null,null,null,null,null,null,{"$f":"+INPUT!$N$6","v":"Dian Misdiyana,S.Pd"},{"$f":"+INPUT!$O$6","v":"Guru Madya"}]
[8,"XII IPA-1",null,null,null,null,null,null,"2013-07-24",2013,"",null,null,null,null,null,null,null,null,null,null,null,null,null,{"$f":"+INPUT!$N$6","v":"Dian Misdiyana,S.Pd"},{"$f":"+INPUT!$O$6","v":"Guru Madya"}]
[9,"XII IPA-1",null,null,null,null,null,null,"2013-07-24",2013,"",null,null,null,null,null,null,null,null,null,null,null,null,null,{"$f":"+INPUT!$N$6","v":"Dian Misdiyana,S.Pd"},{"$f":"+INPUT!$O$6","v":"Guru Madya"}]
[10,"XII IPA-1",null,null,null,null,null,null,"2013-07-24",2013,"",null,null,null,null,null,null,null,null,null,null,null,null,null,{"$f":"+INPUT!$N$6","v":"Dian Misdiyana,S.Pd"},{"$f":"+INPUT!$O$6","v":"Guru Madya"}]
[11,"XII IPA-1",null,null,null,null,null,null,"2013-07-24",2013,"",null,null,null,null,null,null,null,null,null,null,null,null,null,{"$f":"+INPUT!$N$6","v":"Dian Misdiyana,S.Pd"},{"$f":"+INPUT!$O$6","v":"Guru Madya"}]
[12,"XII IPA-1",null,null,null,null,null,null,"2013-07-24",2013,"",null,null,null,null,null,null,null,null,null,null,null,null,null,{"$f":"+INPUT!$N$6","v":"Dian Misdiyana,S.Pd"},{"$f":"+INPUT!$O$6","v":"Guru Madya"}]
[13,"XII IPA-1",null,null,null,null,null,null,"2013-07-24",2013,"",null,null,null,null,null,null,null,null,null,null,null,null,null,{"$f":"+INPUT!$N$6","v":"Dian Misdiyana,S.Pd"},{"$f":"+INPUT!$O$6","v":"Guru Madya"}]
[14,"XII IPA-1",null,null,null,null,null,null,"2013-07-24",2013,"",null,null,null,null,null,null,null,null,null,null,null,null,null,{"$f":"+INPUT!$N$6","v":"Dian Misdiyana,S.Pd"},{"$f":"+INPUT!$O$6","v":"Guru Madya"}]
[15,"XII IPA-1",null,null,null,null,null,null,"2013-07-24",2013,"",null,null,null,null,null,null,null,null,null,null,null,null,null,{"$f":"+INPUT!$N$6","v":"Dian Misdiyana,S.Pd"},{"$f":"+INPUT!$O$6","v":"Guru Madya"}]
[16,"XII IPA-1",null,null,null,null,null,null,"2013-07-24",2013,"",null,null,null,null,null,null,null,null,null,null,null,null,null,{"$f":"+INPUT!$N$6","v":"Dian Misdiyana,S.Pd"},{"$f":"+INPUT!$O$6","v":"Guru Madya"}]
[17,"XII IPA-1",null,null,null,null,null,null,"2013-07-24",2013,"",null,null,null,null,null,null,null,null,null,null,null,null,null,{"$f":"+INPUT!$N$6","v":"Dian Misdiyana,S.Pd"},{"$f":"+INPUT!$O$6","v":"Guru Madya"}]
[18,"XII IPA-1",null,null,null,null,null,null,"2013-07-24",2013,"",null,null,null,null,null,null,null,null,null,null,null,null,null,{"$f":"+INPUT!$N$6","v":"Dian Misdiyana,S.Pd"},{"$f":"+INPUT!$O$6","v":"Guru Madya"}]
[19,"XII IPA-1",null,null,null,null,null,null,"2013-07-24",2013,"",null,null,null,null,null,null,null,null,null,null,null,null,null,{"$f":"+INPUT!$N$6","v":"Dian Misdiyana,S.Pd"},{"$f":"+INPUT!$O$6","v":"Guru Madya"}]
[20,"XII IPA-1",null,null,null,null,null,null,"2013-07-24",2013,"",null,null,null,null,null,null,null,null,null,null,null,null,null,{"$f":"+INPUT!$N$6","v":"Dian Misdiyana,S.Pd"},{"$f":"+INPUT!$O$6","v":"Guru Madya"}]
[21,"XII IPA-1",null,null,null,null,null,null,"2013-07-24",2013,"",null,null,null,null,null,null,null,null,null,null,null,null,null,{"$f":"+INPUT!$N$6","v":"Dian Misdiyana,S.Pd"},{"$f":"+INPUT!$O$6","v":"Guru Madya"}]
[22,"XII IPA-1",null,null,null,null,null,null,"2013-07-24",2013,"",null,null,null,null,null,null,null,null,null,null,null,null,null,{"$f":"+INPUT!$N$6","v":"Dian Misdiyana,S.Pd"},{"$f":"+INPUT!$O$6","v":"Guru Madya"}]
[23,"XII IPA-1",null,null,null,null,null,null,"2013-07-24",2013,"",null,null,null,null,null,null,null,null,null,null,null,null,null,{"$f":"+INPUT!$N$6","v":"Dian Misdiyana,S.Pd"},{"$f":"+INPUT!$O$6","v":"Guru Madya"}]
[24,"XII IPA-1",null,null,null,null,null,null,"2013-07-24",2013,"",null,null,null,null,null,null,null,null,null,null,null,null,null,{"$f":"+INPUT!$N$6","v":"Dian Misdiyana,S.Pd"},{"$f":"+INPUT!$O$6","v":"Guru Madya"}]
[25,"XII IPA-1",null,null,null,null,null,null,"2013-07-24",2013,"",null,null,null,null,null,null,null,null,null,null,null,null,null,{"$f":"+INPUT!$N$6","v":"Dian Misdiyana,S.Pd"},{"$f":"+INPUT!$O$6","v":"Guru Madya"}]
[26,"XII IPA-1",null,null,null,null,null,null,"2013-07-24",2013,"",null,null,null,null,null,null,null,null,null,null,null,null,null,{"$f":"+INPUT!$N$6","v":"Dian Misdiyana,S.Pd"},{"$f":"+INPUT!$O$6","v":"Guru Madya"}]
[27,"XII IPA-1",null,null,null,null,null,null,"2013-07-24",2013,"",null,null,null,null,null,null,null,null,null,null,null,null,null,{"$f":"+INPUT!$N$6","v":"Dian Misdiyana,S.Pd"},{"$f":"+INPUT!$O$6","v":"Guru Madya"}]
[28,"XII IPA-1",null,null,null,null,null,null,"2013-07-24",2013,"",null,null,null,null,null,null,null,null,null,null,null,null,null,{"$f":"+INPUT!$N$6","v":"Dian Misdiyana,S.Pd"},{"$f":"+INPUT!$O$6","v":"Guru Madya"}]
[29,"XII IPA-1",null,null,null,null,null,null,"2013-07-24",2013,"",null,null,null,null,null,null,null,null,null,null,null,null,null,{"$f":"+INPUT!$N$6","v":"Dian Misdiyana,S.Pd"},{"$f":"+INPUT!$O$6","v":"Guru Madya"}]
[30,"XII IPA-1",null,null,null,null,null,null,"2013-07-24",2013,"",null,null,null,null,null,null,null,null,null,null,null,null,null,{"$f":"+INPUT!$N$6","v":"Dian Misdiyana,S.Pd"},{"$f":"+INPUT!$O$6","v":"Guru Madya"}]
[31,"XII IPA-1",null,null,null,null,null,null,"2013-07-24",2013,"",null,null,null,null,null,null,null,null,null,null,null,null,null,{"$f":"+INPUT!$N$6","v":"Dian Misdiyana,S.Pd"},{"$f":"+INPUT!$O$6","v":"Guru Madya"}]
[32,"XII IPA-1",null,null,null,null,null,null,"2013-07-24",2013,"",null,null,null,null,null,null,null,null,null,null,null,null,null,{"$f":"+INPUT!$N$6","v":"Dian Misdiyana,S.Pd"},{"$f":"+INPUT!$O$6","v":"Guru Madya"}]
[33,"XII IPA-1",null,null,null,null,null,null,"2013-07-24",2013,"",null,null,null,null,null,null,null,null,null,null,null,null,null,{"$f":"+INPUT!$N$6","v":"Dian Misdiyana,S.Pd"},{"$f":"+INPUT!$O$6","v":"Guru Madya"}]
[34,"XII IPA-1",null,null,null,null,null,null,"2013-07-24",2013,"",null,null,null,null,null,null,null,null,null,null,null,null,null,{"$f":"+INPUT!$N$6","v":"Dian Misdiyana,S.Pd"},{"$f":"+INPUT!$O$6","v":"Guru Madya"}]
[35,"XII IPA-1",null,null,null,null,null,null,"2013-07-24",2013,"",null,null,null,null,null,null,null,null,null,null,null,null,null,{"$f":"+INPUT!$N$6","v":"Dian Misdiyana,S.Pd"},{"$f":"+INPUT!$O$6","v":"Guru Madya"}]
[36,"XII IPA-1",null,null,null,null,null,null,"2013-07-24",2013,"",null,null,null,null,null,null,null,null,null,null,null,null,null,{"$f":"+INPUT!$N$6","v":"Dian Misdiyana,S.Pd"},{"$f":"+INPUT!$O$6","v":"Guru Madya"}]
[37,"XII IPA-1",null,null,null,null,null,null,"2013-07-24",2013,"",null,null,null,null,null,null,null,null,null,null,null,null,null,{"$f":"+INPUT!$N$6","v":"Dian Misdiyana,S.Pd"},{"$f":"+INPUT!$O$6","v":"Guru Madya"}]
[38,"XII IPA-1",null,null,null,null,null,null,{"$f":"TODAY()","v":"2013-07-24"},2013,"",null,null,null,null,null,null,null,null,null,null,null,null,null,{"$f":"+INPUT!$N$6","v":"Dian Misdiyana,S.Pd"},{"$f":"+INPUT!$O$6","v":"Guru Madya"}]
[39,"XII IPA-1",null,null,null,null,null,null,"2013-07-24",2013,"",null,null,null,null,null,null,null,null,null,null,null,null,null,{"$f":"+INPUT!$N$6","v":"Dian Misdiyana,S.Pd"},{"$f":"+INPUT!$O$6","v":"Guru Madya"}]
[40,"XII IPA-1",null,null,null,null,null,null,"2013-07-24",2013,"",null,null,null,null,null,null,null,null,null,null,null,null,null,{"$f":"+INPUT!$N$6","v":"Dian Misdiyana,S.Pd"},{"$f":"+INPUT!$O$6","v":"Guru Madya"}]
[41,"XII IPA-1",null,null,null,null,null,null,"2013-07-24",2013,"",null,null,null,null,null,null,null,null,null,null,null,null,null,{"$f":"+INPUT!$N$6","v":"Dian Misdiyana,S.Pd"},{"$f":"+INPUT!$O$6","v":"Guru Madya"}]
[42,"XII IPA-1",null,null,null,null,null,null,"2013-07-24",2013,"",null,null,null,null,null,null,null,null,null,null,null,null,null,{"$f":"+INPUT!$N$6","v":"Dian Misdiyana,S.Pd"},{"$f":"+INPUT!$O$6","v":"Guru Madya"}]
[43,"XII IPA-1",null,null,null,null,null,null,"2013-07-24",2013,"",null,null,null,null,null,null,null,null,null,null,null,null,null,{"$f":"+INPUT!$N$6","v":"Dian Misdiyana,S.Pd"},{"$f":"+INPUT!$O$6","v":"Guru Madya"}]
[44,"XII IPA-1",null,null,null,null,null,null,"2013-07-24",2013,"",null,null,null,null,null,null,null,null,null,null,null,null,null,{"$f":"+INPUT!$N$6","v":"Dian Misdiyana,S.Pd"},{"$f":"+INPUT!$O$6","v":"Guru Madya"}]
[45,"XII IPA-1",null,null,null,null,null,null,"2013-07-24",2013,"",null,null,null,null,null,null,null,null,null,null,null,null,null,{"$f":"+INPUT!$N$6","v":"Dian Misdiyana,S.Pd"},{"$f":"+INPUT!$O$6","v":"Guru Madya"}]
[null,null,null,null,null,{"$f":"COUNTIF(F5:F49,\"L\")","v":0},"Laki-laki",null,"14 Th",{"$f":"+K50/$F$52*100%","v":0},{"$f":"COUNTIF(K5:K49,\"14\")","v":0},null,"BURUH HARIAN",0,null,null,null,null,null,"SMP",{"$f":"COUNTIF(U5:U49,\"SMP\")","v":0},"Islam",{"$f":"COUNTIF(W5:W49,\"Islam\")","v":1}]
[null,null,null,null,null,{"$f":"COUNTIF(F5:F49,\"P\")","v":1},"Perempuan",null,"15 Th",0,{"$f":"COUNTIF(K5:K49,\"15\")","v":0},null,"PEG / KARY. SWASTA",0,null,null,null,null,null,"MTs",{"$f":"COUNTIF(U5:U49,\"MTs\")","v":1},"Katolik",{"$f":"COUNTIF(W5:W49,\"Katolik\")","v":0}]
[null,null,null,null,null,{"$f":"+F50+F51","v":1},"Total Siswa",null,"16 Th",0,{"$f":"COUNTIF(K5:K49,\"16\")","v":0},null,"PNS",0,null,null,null,null,null,"Lainnya",{"$f":"+U50+U51","v":1},"Protestan",{"$f":"COUNTIF(W5:W49,\"Protestan\")","v":0}]
[null,null,null,null,null,null,null,null,"17 Th",1,{"$f":"COUNTIF(K5:K49,\"17\")","v":1},null,"WIRASWASTA",0,null,null,null,null,null,null,null,"Hindu",{"$f":"COUNTIF(W5:W49,\"Hindu\")","v":0}]
[null,null,null,null,null,null,null,null,"18 Th",0,{"$f":"COUNTIF(K5:K49,\"18\")","v":0},null,"KARY/ PEGAWAI .BUMN",0,null,null,null,null,null,null,null,"Budha",{"$f":"COUNTIF(W5:W49,\"Budha\")","v":0}]
[null,null,null,null,null,null,null,null,"19 Th",0,{"$f":"COUNTIF(K5:K49,\"19\")","v":0},null,"KEPOLISIAN",0,null,null,null,null,null,null,null,null,{"$f":"SUM(W50:W54)","v":1}]
[null,null,null,null,null,null,null,null,"20 Th",0,{"$f":"COUNTIF(K5:K49,\"20\")","v":0},null,"PENSIUNAN",0]
[null,null,null,null,null,null,null,null,"TOTAL",1,{"$f":"SUM(K50:K56)","v":1},null,"HONORER",0]
[null,null,null,null,null,null,null,null,null,null,null,null,"GURU",0]
[null,null,null,null,null,null,null,null,null,null,null,null,"TAK ADA DATA",0]
[null,null,null,null,null,null,null,null,null,null,null,null,"TOTAL DATA",0]
[null,{"$f":"MAX(A5:A49)","v":45}]
[{"$f":"+$B$61+1","v":46},{"$f":"+INPUT!$M$7","v":"XII IPA-2"},"ALLISYAARA NOERHUZA",1112117,"9960470745","P","SERANG","1996-04-04",{"$f":"TODAY()","v":"2013-07-24"},{"$f":"+$J$3","v":2013},{"$f":"IF(H62=\"\",\"\",DATEDIF(H62,I62,\"y\"))","v":17},"HUZAUDIN",null,null,"JL. SUNAN KUDUS LINK KALENTEMU","DN-30 DI 0029756","DN-30 DI 2837151","2-11-30-03-072-042-7",null,2011,"SMP","(0254) 310508","Islam",null,{"$f":"+INPUT!$N$7","v":"Ria Setiya Wardani,S.Pd"},{"$f":"+INPUT!$O$7","v":"Guru Madya Tk I"},null,null,null,{"$f":"+B62","v":"XII IPA-2"}]
[{"$f":"+A62+1","v":47},{"$f":"IF(A63=0,\" \",+B62)","v":"XII IPA-2"},null,null,null,null,null,null,{"$f":"TODAY()","v":"2013-07-24"},2013,{"$f":"IF(H63=\"\",\"\",DATEDIF(H63,I63,\"y\"))","v":""},null,null,null,null,null,null,null,null,null,null,null,null,null,{"$f":"+INPUT!$N$7","v":"Ria Setiya Wardani,S.Pd"},{"$f":"+INPUT!$O$7","v":"Guru Madya Tk I"}]
[48,"XII IPA-2",null,null,null,null,null,null,"2013-07-24",2013,"",null,null,null,null,null,null,null,null,null,null,null,null,null,{"$f":"+INPUT!$N$7","v":"Ria Setiya Wardani,S.Pd"},{"$f":"+INPUT!$O$7","v":"Guru Madya Tk I"}]
[49,"XII IPA-2",null,null,null,null,null,null,"2013-07-24",2013,"",null,null,null,null,null,null,null,null,null,null,null,null,null,{"$f":"+INPUT!$N$7","v":"Ria Setiya Wardani,S.Pd"},{"$f":"+INPUT!$O$7","v":"Guru Madya Tk I"}]
[50,"XII IPA-2",null,null,null,null,null,null,"2013-07-24",2013,"",null,null,null,null,null,null,null,null,null,null,null,null,null,{"$f":"+INPUT!$N$7","v":"Ria Setiya Wardani,S.Pd"},{"$f":"+INPUT!$O$7","v":"Guru Madya Tk I"}]
[51,"XII IPA-2",null,null,null,null,null,null,"2013-07-24",2013,"",null,null,null,null,null,null,null,null,null,null,null,null,null,{"$f":"+INPUT!$N$7","v":"Ria Setiya Wardani,S.Pd"},{"$f":"+INPUT!$O$7","v":"Guru Madya Tk I"}]
[52,"XII IPA-2",null,null,null,null,null,null,"2013-07-24",2013,"",null,null,null,null,null,null,null,null,null,null,null,null,null,{"$f":"+INPUT!$N$7","v":"Ria Setiya Wardani,S.Pd"},{"$f":"+INPUT!$O$7","v":"Guru Madya Tk I"}]
[53,"XII IPA-2",null,null,null,null,null,null,"2013-07-24",2013,"",null,null,null,null,null,null,null,null,null,null,null,null,null,{"$f":"+INPUT!$N$7","v":"Ria Setiya Wardani,S.Pd"},{"$f":"+INPUT!$O$7","v":"Guru Madya Tk I"}]
[54,"XII IPA-2",null,null,null,null,null,null,"2013-07-24",2013,"",null,null,null,null,null,null,null,null,null,null,null,null,null,{"$f":"+INPUT!$N$7","v":"Ria Setiya Wardani,S.Pd"},{"$f":"+INPUT!$O$7","v":"Guru Madya Tk I"}]
[55,"XII IPA-2",null,null,null,null,null,null,"2013-07-24",2013,"",null,null,null,null,null,null,null,null,null,null,null,null,null,{"$f":"+INPUT!$N$7","v":"Ria Setiya Wardani,S.Pd"},{"$f":"+INPUT!$O$7","v":"Guru Madya Tk I"}]
[56,"XII IPA-2",null,null,null,null,null,null,"2013-07-24",2013,"",null,null,null,null,null,null,null,null,null,null,null,null,null,{"$f":"+INPUT!$N$7","v":"Ria Setiya Wardani,S.Pd"},{"$f":"+INPUT!$O$7","v":"Guru Madya Tk I"}]
[57,"XII IPA-2",null,null,null,null,null,null,"2013-07-24",2013,"",null,null,null,null,null,null,null,null,null,null,null,null,null,{"$f":"+INPUT!$N$7","v":"Ria Setiya Wardani,S.Pd"},{"$f":"+INPUT!$O$7","v":"Guru Madya Tk I"}]
[58,"XII IPA-2",null,null,null,null,null,null,"2013-07-24",2013,"",null,null,null,null,null,null,null,null,null,null,null,null,null,{"$f":"+INPUT!$N$7","v":"Ria Setiya Wardani,S.Pd"},{"$f":"+INPUT!$O$7","v":"Guru Madya Tk I"}]
[59,"XII IPA-2",null,null,null,null,null,null,"2013-07-24",2013,"",null,null,null,null,null,null,null,null,null,null,null,null,null,{"$f":"+INPUT!$N$7","v":"Ria Setiya Wardani,S.Pd"},{"$f":"+INPUT!$O$7","v":"Guru Madya Tk I"}]
[60,"XII IPA-2",null,null,null,null,null,null,"2013-07-24",2013,"",null,null,null,null,null,null,null,null,null,null,null,null,null,{"$f":"+INPUT!$N$7","v":"Ria Setiya Wardani,S.Pd"},{"$f":"+INPUT!$O$7","v":"Guru Madya Tk I"}]
[61,"XII IPA-2",null,null,null,null,null,null,"2013-07-24",2013,"",null,null,null,null,null,null,null,null,null,null,null,null,null,{"$f":"+INPUT!$N$7","v":"Ria Setiya Wardani,S.Pd"},{"$f":"+INPUT!$O$7","v":"Guru Madya Tk I"}]
[62,"XII IPA-2",null,null,null,null,null,null,"2013-07-24",2013,"",null,null,null,null,null,null,null,null,null,null,null,null,null,{"$f":"+INPUT!$N$7","v":"Ria Setiya Wardani,S.Pd"},{"$f":"+INPUT!$O$7","v":"Guru Madya Tk I"}]
[63,"XII IPA-2",null,null,null,null,null,null,"2013-07-24",2013,"",null,null,null,null,null,null,null,null,null,null,null,null,null,{"$f":"+INPUT!$N$7","v":"Ria Setiya Wardani,S.Pd"},{"$f":"+INPUT!$O$7","v":"Guru Madya Tk I"}]
[64,"XII IPA-2",null,null,null,null,null,null,"2013-07-24",2013,"",null,null,null,null,null,null,null,null,null,null,null,null,null,{"$f":"+INPUT!$N$7","v":"Ria Setiya Wardani,S.Pd"},{"$f":"+INPUT!$O$7","v":"Guru Madya Tk I"}]
[65,"XII IPA-2",null,null,null,null,null,null,"2013-07-24",2013,"",null,null,null,null,null,null,null,null,null,null,null,null,null,{"$f":"+INPUT!$N$7","v":"Ria Setiya Wardani,S.Pd"},{"$f":"+INPUT!$O$7","v":"Guru Madya Tk I"}]
[66,"XII IPA-2",null,null,null,null,null,null,"2013-07-24",2013,"",null,null,null,null,null,null,null,null,null,null,null,null,null,{"$f":"+INPUT!$N$7","v":"Ria Setiya Wardani,S.Pd"},{"$f":"+INPUT!$O$7","v":"Guru Madya Tk I"}]
[67,"XII IPA-2",null,null,null,null,null,null,"2013-07-24",2013,"",null,null,null,null,null,null,null,null,null,null,null,null,null,{"$f":"+INPUT!$N$7","v":"Ria Setiya Wardani,S.Pd"},{"$f":"+INPUT!$O$7","v":"Guru Madya Tk I"}]
[68,"XII IPA-2",null,null,null,null,null,null,"2013-07-24",2013,"",null,null,null,null,null,null,null,null,null,null,null,null,null,{"$f":"+INPUT!$N$7","v":"Ria Setiya Wardani,S.Pd"},{"$f":"+INPUT!$O$7","v":"Guru Madya Tk I"}]
[69,"XII IPA-2",null,null,null,null,null,null,"2013-07-24",2013,"",null,null,null,null,null,null,null,null,null,null,null,null,null,{"$f":"+INPUT!$N$7","v":"Ria Setiya Wardani,S.Pd"},{"$f":"+INPUT!$O$7","v":"Guru Madya Tk I"}]
[70,"XII IPA-2",null,null,null,null,null,null,"2013-07-24",2013,"",null,null,null,null,null,null,null,null,null,null,null,null,null,{"$f":"+INPUT!$N$7","v":"Ria Setiya Wardani,S.Pd"},{"$f":"+INPUT!$O$7","v":"Guru Madya Tk I"}]
[71,"XII IPA-2",null,null,null,null,null,null,"2013-07-24",2013,"",null,null,null,null,null,null,null,null,null,null,null,null,null,{"$f":"+INPUT!$N$7","v":"Ria Setiya Wardani,S.Pd"},{"$f":"+INPUT!$O$7","v":"Guru Madya Tk I"}]
[72,"XII IPA-2",null,null,null,null,null,null,"2013-07-24",2013,"",null,null,null,null,null,null,null,null,null,null,null,null,null,{"$f":"+INPUT!$N$7","v":"Ria Setiya Wardani,S.Pd"},{"$f":"+INPUT!$O$7","v":"Guru Madya Tk I"}]
[73,"XII IPA-2",null,null,null,null,null,null,"2013-07-24",2013,"",null,null,null,null,null,null,null,null,null,null,null,null,null,{"$f":"+INPUT!$N$7","v":"Ria Setiya Wardani,S.Pd"},{"$f":"+INPUT!$O$7","v":"Guru Madya Tk I"}]
[74,"XII IPA-2",null,null,null,null,null,null,"2013-07-24",2013,"",null,null,null,null,null,null,null,null,null,null,null,null,null,{"$f":"+INPUT!$N$7","v":"Ria Setiya Wardani,S.Pd"},{"$f":"+INPUT!$O$7","v":"Guru Madya Tk I"}]
[75,"XII IPA-2",null,null,null,null,null,null,"2013-07-24",2013,"",null,null,null,null,null,null,null,null,null,null,null,null,null,{"$f":"+INPUT!$N$7","v":"Ria Setiya Wardani,S.Pd"},{"$f":"+INPUT!$O$7","v":"Guru Madya Tk I"}]
[76,"XII IPA-2",null,null,null,null,null,null,"2013-07-24",2013,"",null,null,null,null,null,null,null,null,null,null,null,null,null,{"$f":"+INPUT!$N$7","v":"Ria Setiya Wardani,S.Pd"},{"$f":"+INPUT!$O$7","v":"Guru Madya Tk I"}]
[77,"XII IPA-2",null,null,null,null,null,null,"2013-07-24",2013,"",null,null,null,null,null,null,null,null,null,null,null,null,null,{"$f":"+INPUT!$N$7","v":"Ria Setiya Wardani,S.Pd"},{"$f":"+INPUT!$O$7","v":"Guru Madya Tk I"}]
[78,"XII IPA-2",null,null,null,null,null,null,"2013-07-24",2013,"",null,null,null,null,null,null,null,null,null,null,null,null,null,{"$f":"+INPUT!$N$7","v":"Ria Setiya Wardani,S.Pd"},{"$f":"+INPUT!$O$7","v":"Guru Madya Tk I"}]
[79,"XII IPA-2",null,null,null,null,null,null,"2013-07-24",2013,"",null,null,null,null,null,null,null,null,null,null,null,null,null,{"$f":"+INPUT!$N$7","v":"Ria Setiya Wardani,S.Pd"},{"$f":"+INPUT!$O$7","v":"Guru Madya Tk I"}]
[80,"XII IPA-2",null,null,null,null,null,null,"2013-07-24",2013,"",null,null,null,null,null,null,null,null,null,null,null,null,null,{"$f":"+INPUT!$N$7","v":"Ria Setiya Wardani,S.Pd"},{"$f":"+INPUT!$O$7","v":"Guru Madya Tk I"}]
[81,"XII IPA-2",null,null,null,null,null,null,"2013-07-24",2013,"",null,null,null,null,null,null,null,null,null,null,null,null,null,{"$f":"+INPUT!$N$7","v":"Ria Setiya Wardani,S.Pd"},{"$f":"+INPUT!$O$7","v":"Guru Madya Tk I"}]
[82,"XII IPA-2",null,null,null,null,null,null,"2013-07-24",2013,"",null,null,null,null,null,null,null,null,null,null,null,null,null,{"$f":"+INPUT!$N$7","v":"Ria Setiya Wardani,S.Pd"},{"$f":"+INPUT!$O$7","v":"Guru Madya Tk I"}]
[83,"XII IPA-2",null,null,null,null,null,null,{"$f":"TODAY()","v":"2013-07-24"},2013,"",null,null,null,null,null,null,null,null,null,null,null,null,null,{"$f":"+INPUT!$N$7","v":"Ria Setiya Wardani,S.Pd"},{"$f":"+INPUT!$O$7","v":"Guru Madya Tk I"}]
[84,"XII IPA-2",null,null,null,null,null,null,"2013-07-24",2013,"",null,null,null,null,null,null,null,null,null,null,null,null,null,{"$f":"+INPUT!$N$7","v":"Ria Setiya Wardani,S.Pd"},{"$f":"+INPUT!$O$7","v":"Guru Madya Tk I"}]
[85,"XII IPA-2",null,null,null,null,null,null,"2013-07-24",2013,"",null,null,null,null,null,null,null,null,null,null,null,null,null,{"$f":"+INPUT!$N$7","v":"Ria Setiya Wardani,S.Pd"},{"$f":"+INPUT!$O$7","v":"Guru Madya Tk I"}]
[86,"XII IPA-2",null,null,null,null,null,null,"2013-07-24",2013,"",null,null,null,null,null,null,null,null,null,null,null,null,null,{"$f":"+INPUT!$N$7","v":"Ria Setiya Wardani,S.Pd"},{"$f":"+INPUT!$O$7","v":"Guru Madya Tk I"}]
[87,"XII IPA-2",null,null,null,null,null,null,"2013-07-24",2013,"",null,null,null,null,null,null,null,null,null,null,null,null,null,{"$f":"+INPUT!$N$7","v":"Ria Setiya Wardani,S.Pd"},{"$f":"+INPUT!$O$7","v":"Guru Madya Tk I"}]
[88,"XII IPA-2",null,null,null,null,null,null,"2013-07-24",2013,"",null,null,null,null,null,null,null,null,null,null,null,null,null,{"$f":"+INPUT!$N$7","v":"Ria Setiya Wardani,S.Pd"},{"$f":"+INPUT!$O$7","v":"Guru Madya Tk I"}]
[89,"XII IPA-2",null,null,null,null,null,null,"2013-07-24",2013,"",null,null,null,null,null,null,null,null,null,null,null,null,null,{"$f":"+INPUT!$N$7","v":"Ria Setiya Wardani,S.Pd"},{"$f":"+INPUT!$O$7","v":"Guru Madya Tk I"}]
[90,"XII IPA-2",null,null,null,null,null,null,"2013-07-24",2013,"",null,null,null,null,null,null,null,null,null,null,null,null,null,{"$f":"+INPUT!$N$7","v":"Ria Setiya Wardani,S.Pd"},{"$f":"+INPUT!$O$7","v":"Guru Madya Tk I"}]
[null,null,null,null,null,{"$f":"COUNTIF(F62:F106,\"L\")","v":0},"Laki-laki",null,"14 Th",{"$f":"+K107/$F$52*100%","v":0},{"$f":"COUNTIF(K62:K106,\"14\")","v":0},null,"BURUH HARIAN",0,null,null,null,null,null,"SMP",{"$f":"COUNTIF(U62:U106,\"SMP\")","v":1},"Islam",{"$f":"COUNTIF(W62:W106,\"Islam\")","v":1}]
[null,null,null,null,null,{"$f":"COUNTIF(F62:F106,\"P\")","v":1},"Perempuan",null,"15 Th",0,{"$f":"COUNTIF(K62:K106,\"15\")","v":0},null,"PEG / KARY. SWASTA",0,null,null,null,null,null,"MTs",{"$f":"COUNTIF(U62:U106,\"MTs\")","v":0},"Katolik",{"$f":"COUNTIF(W62:W106,\"Katolik\")","v":0}]
[null,null,null,null,null,{"$f":"SUM(F107:F108)","v":1},"Total Siswa",null,"16 Th",0,{"$f":"COUNTIF(K62:K106,\"16\")","v":0},null,"PNS",0,null,null,null,null,null,"Lainnya",{"$f":"+U107+U108","v":1},"Protestan",{"$f":"COUNTIF(W62:W106,\"Protestan\")","v":0}]
[null,null,null,null,null,null,null,null,"17 Th",1,{"$f":"COUNTIF(K62:K106,\"17\")","v":1},null,"WIRASWASTA",0,null,null,null,null,null,null,null,"Hindu",{"$f":"COUNTIF(W62:W106,\"Hindu\")","v":0}]
[null,null,null,null,null,null,null,null,"18 Th",0,{"$f":"COUNTIF(K62:K106,\"18\")","v":0},null,"KARY/ PEGAWAI .BUMN",0,null,null,null,null,null,null,null,"Budha",{"$f":"COUNTIF(W62:W106,\"Budha\")","v":0}]
[null,null,null,null,null,null,null,null,"19 Th",0,{"$f":"COUNTIF(K62:K106,\"19\")","v":0},null,"KEPOLISIAN",0,null,null,null,null,null,null,null,null,{"$f":"SUM(W107:W111)","v":1}]
[null,null,null,null,null,null,null,null,"20 Th",0,{"$f":"COUNTIF(K62:K106,\"20\")","v":0},null,"PENSIUNAN",0]
[null,null,null,null,null,null,null,null,"TOTAL",1,{"$f":"SUM(K107:K113)","v":1},null,"HONORER",0]
[null,null,null,null,null,null,null,null,null,null,null,null,"GURU",0]
[null,null,null,null,null,null,null,null,null,null,null,null,"TAK ADA DATA",0]
[null,null,null,null,null,null,null,null,null,null,null,null,"TOTAL DATA",0]
[null,{"$f":"MAX(A62:A106)","v":90}]
[{"$f":"+$B$118+1","v":91},{"$f":"+INPUT!$M$8","v":"XII IPA-3"},"ADI FIRMANSYAH",1112078,"9965293057","L","SERANG","1995-11-01",{"$f":"TODAY()","v":"2013-07-24"},{"$f":"+$J$3","v":2013},{"$f":"IF(H119=\"\",\"\",DATEDIF(H119,I119,\"y\"))","v":17},"IMAM SUPARDI",null,null,"JL LADA BLOCK A1 NO.5 CIWEDUS","DN-30-DI-0028476",null,"2-11-30-03-006-152-9",null,2011,"SMP","087871010423","Islam",null,{"$f":"+INPUT!$N$8","v":"Farida  Kustyarini,S.Si"},{"$f":"+INPUT!$O$8","v":"Guru Madya Tk I"},null,null,null,{"$f":"+B119","v":"XII IPA-3"}]
[{"$f":"+A119+1","v":92},{"$f":"IF(A120=0,\" \",+B119)","v":"XII IPA-3"},null,null,null,null,null,null,{"$f":"TODAY()","v":"2013-07-24"},2013,{"$f":"IF(H120=\"\",\"\",DATEDIF(H120,I120,\"y\"))","v":""},null,null,null,null,null,null,null,null,null,null,null,null,null,{"$f":"+INPUT!$N$8","v":"Farida  Kustyarini,S.Si"},{"$f":"+INPUT!$O$8","v":"Guru Madya Tk I"}]
[93,"XII IPA-3",null,null,null,null,null,null,"2013-07-24",2013,"",null,null,null,null,null,null,null,null,null,null,null,null,null,{"$f":"+INPUT!$N$8","v":"Farida  Kustyarini,S.Si"},{"$f":"+INPUT!$O$8","v":"Guru Madya Tk I"}]
[94,"XII IPA-3",null,null,null,null,null,null,"2013-07-24",2013,"",null,null,null,null,null,null,null,null,null,null,null,null,null,{"$f":"+INPUT!$N$8","v":"Farida  Kustyarini,S.Si"},{"$f":"+INPUT!$O$8","v":"Guru Madya Tk I"}]
[95,"XII IPA-3",null,null,null,null,null,null,"2013-07-24",2013,"",null,null,null,null,null,null,null,null,null,null,null,null,null,{"$f":"+INPUT!$N$8","v":"Farida  Kustyarini,S.Si"},{"$f":"+INPUT!$O$8","v":"Guru Madya Tk I"}]
[96,"XII IPA-3",null,null,null,null,null,null,"2013-07-24",2013,"",null,null,null,null,null,null,null,null,null,null,null,null,null,{"$f":"+INPUT!$N$8","v":"Farida  Kustyarini,S.Si"},{"$f":"+INPUT!$O$8","v":"Guru Madya Tk I"}]
[97,"XII IPA-3",null,null,null,null,null,null,"2013-07-24",2013,"",null,null,null,null,null,null,null,null,null,null,null,null,null,{"$f":"+INPUT!$N$8","v":"Farida  Kustyarini,S.Si"},{"$f":"+INPUT!$O$8","v":"Guru Madya Tk I"}]
[98,"XII IPA-3",null,null,null,null,null,null,"2013-07-24",2013,"",null,null,null,null,null,null,null,null,null,null,null,null,null,{"$f":"+INPUT!$N$8","v":"Farida  Kustyarini,S.Si"},{"$f":"+INPUT!$O$8","v":"Guru Madya Tk I"}]
[99,"XII IPA-3",null,null,null,null,null,null,"2013-07-24",2013,"",null,null,null,null,null,null,null,null,null,null,null,null,null,{"$f":"+INPUT!$N$8","v":"Farida  Kustyarini,S.Si"},{"$f":"+INPUT!$O$8","v":"Guru Madya Tk I"}]
[100,"XII IPA-3",null,null,null,null,null,null,"2013-07-24",2013,"",null,null,null,null,null,null,null,null,null,null,null,null,null,{"$f":"+INPUT!$N$8","v":"Farida  Kustyarini,S.Si"},{"$f":"+INPUT!$O$8","v":"Guru Madya Tk I"}]
[101,"XII IPA-3",null,null,null,null,null,null,"2013-07-24",2013,"",null,null,null,null,null,null,null,null,null,null,null,null,null,{"$f":"+INPUT!$N$8","v":"Farida  Kustyarini,S.Si"},{"$f":"+INPUT!$O$8","v":"Guru Madya Tk I"}]
[102,"XII IPA-3",null,null,null,null,null,null,"2013-07-24",2013,"",null,null,null,null,null,null,null,null,null,null,null,null,null,{"$f":"+INPUT!$N$8","v":"Farida  Kustyarini,S.Si"},{"$f":"+INPUT!$O$8","v":"Guru Madya Tk I"}]
[103,"XII IPA-3",null,null,null,null,null,null,"2013-07-24",2013,"",null,null,null,null,null,null,null,null,null,null,null,null,null,{"$f":"+INPUT!$N$8","v":"Farida  Kustyarini,S.Si"},{"$f":"+INPUT!$O$8","v":"Guru Madya Tk I"}]
[104,"XII IPA-3",null,null,null,null,null,null,"2013-07-24",2013,"",null,null,null,null,null,null,null,null,null,null,null,null,null,{"$f":"+INPUT!$N$8","v":"Farida  Kustyarini,S.Si"},{"$f":"+INPUT!$O$8","v":"Guru Madya Tk I"}]
[105,"XII IPA-3",null,null,null,null,null,null,"2013-07-24",2013,"",null,null,null,null,null,null,null,null,null,null,null,null,null,{"$f":"+INPUT!$N$8","v":"Farida  Kustyarini,S.Si"},{"$f":"+INPUT!$O$8","v":"Guru Madya Tk I"}]
[106,"XII IPA-3",null,null,null,null,null,null,"2013-07-24",2013,"",null,null,null,null,null,null,null,null,null,null,null,null,null,{"$f":"+INPUT!$N$8","v":"Farida  Kustyarini,S.Si"},{"$f":"+INPUT!$O$8","v":"Guru Madya Tk I"}]
[107,"XII IPA-3",null,null,null,null,null,null,"2013-07-24",2013,"",null,null,null,null,null,null,null,null,null,null,null,null,null,{"$f":"+INPUT!$N$8","v":"Farida  Kustyarini,S.Si"},{"$f":"+INPUT!$O$8","v":"Guru Madya Tk I"}]
[108,"XII IPA-3",null,null,null,null,null,null,"2013-07-24",2013,"",null,null,null,null,null,null,null,null,null,null,null,null,null,{"$f":"+INPUT!$N$8","v":"Farida  Kustyarini,S.Si"},{"$f":"+INPUT!$O$8","v":"Guru Madya Tk I"}]
[109,"XII IPA-3",null,null,null,null,null,null,"2013-07-24",2013,"",null,null,null,null,null,null,null,null,null,null,null,null,null,{"$f":"+INPUT!$N$8","v":"Farida  Kustyarini,S.Si"},{"$f":"+INPUT!$O$8","v":"Guru Madya Tk I"}]
[110,"XII IPA-3",null,null,null,null,null,null,"2013-07-24",2013,"",null,null,null,null,null,null,null,null,null,null,null,null,null,{"$f":"+INPUT!$N$8","v":"Farida  Kustyarini,S.Si"},{"$f":"+INPUT!$O$8","v":"Guru Madya Tk I"}]
[111,"XII IPA-3",null,null,null,null,null,null,"2013-07-24",2013,"",null,null,null,null,null,null,null,null,null,null,null,null,null,{"$f":"+INPUT!$N$8","v":"Farida  Kustyarini,S.Si"},{"$f":"+INPUT!$O$8","v":"Guru Madya Tk I"}]
[112,"XII IPA-3",null,null,null,null,null,null,"2013-07-24",2013,"",null,null,null,null,null,null,null,null,null,null,null,null,null,{"$f":"+INPUT!$N$8","v":"Farida  Kustyarini,S.Si"},{"$f":"+INPUT!$O$8","v":"Guru Madya Tk I"}]
[113,"XII IPA-3",null,null,null,null,null,null,"2013-07-24",2013,"",null,null,null,null,null,null,null,null,null,null,null,null,null,{"$f":"+INPUT!$N$8","v":"Farida  Kustyarini,S.Si"},{"$f":"+INPUT!$O$8","v":"Guru Madya Tk I"}]
[114,"XII IPA-3",null,null,null,null,null,null,"2013-07-24",2013,"",null,null,null,null,null,null,null,null,null,null,null,null,null,{"$f":"+INPUT!$N$8","v":"Farida  Kustyarini,S.Si"},{"$f":"+INPUT!$O$8","v":"Guru Madya Tk I"}]
[115,"XII IPA-3",null,null,null,null,null,null,"2013-07-24",2013,"",null,null,null,null,null,null,null,null,null,null,null,null,null,{"$f":"+INPUT!$N$8","v":"Farida  Kustyarini,S.Si"},{"$f":"+INPUT!$O$8","v":"Guru Madya Tk I"}]
[116,"XII IPA-3",null,null,null,null,null,null,"2013-07-24",2013,"",null,null,null,null,null,null,null,null,null,null,null,null,null,{"$f":"+INPUT!$N$8","v":"Farida  Kustyarini,S.Si"},{"$f":"+INPUT!$O$8","v":"Guru Madya Tk I"}]
[117,"XII IPA-3",null,null,null,null,null,null,"2013-07-24",2013,"",null,null,null,null,null,null,null,null,null,null,null,null,null,{"$f":"+INPUT!$N$8","v":"Farida  Kustyarini,S.Si"},{"$f":"+INPUT!$O$8","v":"Guru Madya Tk I"}]
[118,"XII IPA-3",null,null,null,null,null,null,"2013-07-24",2013,"",null,null,null,null,null,null,null,null,null,null,null,null,null,{"$f":"+INPUT!$N$8","v":"Farida  Kustyarini,S.Si"},{"$f":"+INPUT!$O$8","v":"Guru Madya Tk I"}]
[119,"XII IPA-3",null,null,null,null,null,null,"2013-07-24",2013,"",null,null,null,null,null,null,null,null,null,null,null,null,null,{"$f":"+INPUT!$N$8","v":"Farida  Kustyarini,S.Si"},{"$f":"+INPUT!$O$8","v":"Guru Madya Tk I"}]
[120,"XII IPA-3",null,null,null,null,null,null,"2013-07-24",2013,"",null,null,null,null,null,null,null,null,null,null,null,null,null,{"$f":"+INPUT!$N$8","v":"Farida  Kustyarini,S.Si"},{"$f":"+INPUT!$O$8","v":"Guru Madya Tk I"}]
[121,"XII IPA-3",null,null,null,null,null,null,"2013-07-24",2013,"",null,null,null,null,null,null,null,null,null,null,null,null,null,{"$f":"+INPUT!$N$8","v":"Farida  Kustyarini,S.Si"},{"$f":"+INPUT!$O$8","v":"Guru Madya Tk I"}]
[122,"XII IPA-3",null,null,null,null,null,null,"2013-07-24",2013,"",null,null,null,null,null,null,null,null,null,null,null,null,null,{"$f":"+INPUT!$N$8","v":"Farida  Kustyarini,S.Si"},{"$f":"+INPUT!$O$8","v":"Guru Madya Tk I"}]
[123,"XII IPA-3",null,null,null,null,null,null,"2013-07-24",2013,"",null,null,null,null,null,null,null,null,null,null,null,null,null,{"$f":"+INPUT!$N$8","v":"Farida  Kustyarini,S.Si"},{"$f":"+INPUT!$O$8","v":"Guru Madya Tk I"}]
[124,"XII IPA-3",null,null,null,null,null,null,"2013-07-24",2013,"",null,null,null,null,null,null,null,null,null,null,null,null,null,{"$f":"+INPUT!$N$8","v":"Farida  Kustyarini,S.Si"},{"$f":"+INPUT!$O$8","v":"Guru Madya Tk I"}]
[125,"XII IPA-3",null,null,null,null,null,null,"2013-07-24",2013,"",null,null,null,null,null,null,null,null,null,null,null,null,null,{"$f":"+INPUT!$N$8","v":"Farida  Kustyarini,S.Si"},{"$f":"+INPUT!$O$8","v":"Guru Madya Tk I"}]
[126,"XII IPA-3",null,null,null,null,null,null,"2013-07-24",2013,"",null,null,null,null,null,null,null,null,null,null,null,null,null,{"$f":"+INPUT!$N$8","v":"Farida  Kustyarini,S.Si"},{"$f":"+INPUT!$O$8","v":"Guru Madya Tk I"}]
[127,"XII IPA-3",null,null,null,null,null,null,"2013-07-24",2013,"",null,null,null,null,null,null,null,null,null,null,null,null,null,{"$f":"+INPUT!$N$8","v":"Farida  Kustyarini,S.Si"},{"$f":"+INPUT!$O$8","v":"Guru Madya Tk I"}]
[128,"XII IPA-3",null,null,null,null,null,null,{"$f":"TODAY()","v":"2013-07-24"},2013,"",null,null,null,null,null,null,null,null,null,null,null,null,null,{"$f":"+INPUT!$N$8","v":"Farida  Kustyarini,S.Si"},{"$f":"+INPUT!$O$8","v":"Guru Madya Tk I"}]
[129,"XII IPA-3",null,null,null,null,null,null,"2013-07-24",2013,"",null,null,null,null,null,null,null,null,null,null,null,null,null,{"$f":"+INPUT!$N$8","v":"Farida  Kustyarini,S.Si"},{"$f":"+INPUT!$O$8","v":"Guru Madya Tk I"}]
[130,"XII IPA-3",null,null,null,null,null,null,"2013-07-24",2013,"",null,null,null,null,null,null,null,null,null,null,null,null,null,{"$f":"+INPUT!$N$8","v":"Farida  Kustyarini,S.Si"},{"$f":"+INPUT!$O$8","v":"Guru Madya Tk I"}]
[131,"XII IPA-3",null,null,null,null,null,null,"2013-07-24",2013,"",null,null,null,null,null,null,null,null,null,null,null,null,null,{"$f":"+INPUT!$N$8","v":"Farida  Kustyarini,S.Si"},{"$f":"+INPUT!$O$8","v":"Guru Madya Tk I"}]
[132,"XII IPA-3",null,null,null,null,null,null,"2013-07-24",2013,"",null,null,null,null,null,null,null,null,null,null,null,null,null,{"$f":"+INPUT!$N$8","v":"Farida  Kustyarini,S.Si"},{"$f":"+INPUT!$O$8","v":"Guru Madya Tk I"}]
[133,"XII IPA-3",null,null,null,null,null,null,"2013-07-24",2013,"",null,null,null,null,null,null,null,null,null,null,null,null,null,{"$f":"+INPUT!$N$8","v":"Farida  Kustyarini,S.Si"},{"$f":"+INPUT!$O$8","v":"Guru Madya Tk I"}]
[134,"XII IPA-3",null,null,null,null,null,null,"2013-07-24",2013,"",null,null,null,null,null,null,null,null,null,null,null,null,null,{"$f":"+INPUT!$N$8","v":"Farida  Kustyarini,S.Si"},{"$f":"+INPUT!$O$8","v":"Guru Madya Tk I"}]
[135,"XII IPA-3",null,null,null,null,null,null,"2013-07-24",2013,"",null,null,null,null,null,null,null,null,null,null,null,null,null,{"$f":"+INPUT!$N$8","v":"Farida  Kustyarini,S.Si"},{"$f":"+INPUT!$O$8","v":"Guru Madya Tk I"}]
[null,null,null,null,null,{"$f":"COUNTIF(F119:F163,\"L\")","v":1},"Laki-laki",null,"14 Th",{"$f":"+K164/$F$52*100%","v":0},{"$f":"COUNTIF(K119:K163,\"14\")","v":0},null,"BURUH HARIAN",0,null,null,null,null,null,"SMP",{"$f":"COUNTIF(U119:U163,\"SMP\")","v":1},"Islam",{"$f":"COUNTIF(W119:W163,\"Islam\")","v":1}]
[null,null,null,null,null,{"$f":"COUNTIF(F119:F163,\"P\")","v":0},"Perempuan",null,"15 Th",0,{"$f":"COUNTIF(K119:K163,\"15\")","v":0},null,"PEG / KARY. SWASTA",0,null,null,null,null,null,"MTs",{"$f":"COUNTIF(U119:U163,\"MTs\")","v":0},"Katolik",{"$f":"COUNTIF(W119:W163,\"Katolik\")","v":0}]
[null,null,null,null,null,{"$f":"SUM(F164:F165)","v":1},"Total Siswa",null,"16 Th",0,{"$f":"COUNTIF(K119:K163,\"16\")","v":0},null,"PNS",0,null,null,null,null,null,"Lainnya",{"$f":"+U164+U165","v":1},"Protestan",{"$f":"COUNTIF(W119:W163,\"Protestan\")","v":0}]
[null,null,null,null,null,null,null,null,"17 Th",1,{"$f":"COUNTIF(K119:K163,\"17\")","v":1},null,"WIRASWASTA",0,null,null,null,null,null,null,null,"Hindu",{"$f":"COUNTIF(W119:W163,\"Hindu\")","v":0}]
[null,null,null,null,null,null,null,null,"18 Th",0,{"$f":"COUNTIF(K119:K163,\"18\")","v":0},null,"KARY/ PEGAWAI .BUMN",0,null,null,null,null,null,null,null,"Budha",{"$f":"COUNTIF(W119:W163,\"Budha\")","v":0}]
[null,null,null,null,null,null,null,null,"19 Th",0,{"$f":"COUNTIF(K119:K163,\"19\")","v":0},null,"KEPOLISIAN",0,null,null,null,null,null,null,null,null,{"$f":"SUM(W164:W168)","v":1}]
[null,null,null,null,null,null,null,null,"20 Th",0,{"$f":"COUNTIF(K119:K163,\"20\")","v":0},null,"PENSIUNAN",0]
[null,null,null,null,null,null,null,null,"TOTAL",1,{"$f":"SUM(K164:K170)","v":1},null,"HONORER",0]
[null,null,null,null,null,null,null,null,null,null,null,null,"GURU",0]
[null,null,null,null,null,null,null,null,null,null,null,null,"TAK ADA DATA",0]
[null,null,null,null,null,null,null,null,null,null,null,null,"TOTAL DATA",0]
[null,{"$f":"MAX(A119:A163)","v":135}]
[{"$f":"+$B$175+1","v":136},{"$f":"+INPUT!$M$9","v":"XII IPS-1"},"AGI PURNAMA BELRA",1112155,"9962208731","L","SERANG","1996-08-03",{"$f":"TODAY()","v":"2013-07-24"},{"$f":"+$J$3","v":2013},{"$f":"IF(H176=\"\",\"\",DATEDIF(H176,I176,\"y\"))","v":16},"MARKORI",null,null,"JL. RAYA CILEGON, KM8 RT 03/01 NO.92 KRAMAT WATU SERDANG BANTEN","DN-30-DI-0028232",null,"2-11-30-03-005-097-8",null,2011,"SMP","081316620512","Islam",null,{"$f":"+INPUT!$N$9","v":"Nanik Tri Handayani,S.Pd"},{"$f":"+INPUT!$O$9","v":"Guru Madya"},null,null,null,{"$f":"+B176","v":"XII IPS-1"}]
[{"$f":"+A176+1","v":137},{"$f":"IF(A177=0,\" \",+B176)","v":"XII IPS-1"},null,null,null,null,null,null,{"$f":"TODAY()","v":"2013-07-24"},2013,{"$f":"IF(H177=\"\",\"\",DATEDIF(H177,I177,\"y\"))","v":""},null,null,null,null,null,null,null,null,null,null,null,null,null,{"$f":"+INPUT!$N$9","v":"Nanik Tri Handayani,S.Pd"},{"$f":"+INPUT!$O$9","v":"Guru Madya"}]
[138,"XII IPS-1",null,null,null,null,null,null,"2013-07-24",2013,"",null,null,null,null,null,null,null,null,null,null,null,null,null,{"$f":"+INPUT!$N$9","v":"Nanik Tri Handayani,S.Pd"},{"$f":"+INPUT!$O$9","v":"Guru Madya"}]
[139,"XII IPS-1",null,null,null,null,null,null,"2013-07-24",2013,"",null,null,null,null,null,null,null,null,null,null,null,null,null,{"$f":"+INPUT!$N$9","v":"Nanik Tri Handayani,S.Pd"},{"$f":"+INPUT!$O$9","v":"Guru Madya"}]
[140,"XII IPS-1",null,null,null,null,null,null,"2013-07-24",2013,"",null,null,null,null,null,null,null,null,null,null,null,null,null,{"$f":"+INPUT!$N$9","v":"Nanik Tri Handayani,S.Pd"},{"$f":"+INPUT!$O$9","v":"Guru Madya"}]
[141,"XII IPS-1",null,null,null,null,null,null,"2013-07-24",2013,"",null,null,null,null,null,null,null,null,null,null,null,null,null,{"$f":"+INPUT!$N$9","v":"Nanik Tri Handayani,S.Pd"},{"$f":"+INPUT!$O$9","v":"Guru Madya"}]
[142,"XII IPS-1",null,null,null,null,null,null,"2013-07-24",2013,"",null,null,null,null,null,null,null,null,null,null,null,null,null,{"$f":"+INPUT!$N$9","v":"Nanik Tri Handayani,S.Pd"},{"$f":"+INPUT!$O$9","v":"Guru Madya"}]
[143,"XII IPS-1",null,null,null,null,null,null,"2013-07-24",2013,"",null,null,null,null,null,null,null,null,null,null,null,null,null,{"$f":"+INPUT!$N$9","v":"Nanik Tri Handayani,S.Pd"},{"$f":"+INPUT!$O$9","v":"Guru Madya"}]
[144,"XII IPS-1",null,null,null,null,null,null,"2013-07-24",2013,"",null,null,null,null,null,null,null,null,null,null,null,null,null,{"$f":"+INPUT!$N$9","v":"Nanik Tri Handayani,S.Pd"},{"$f":"+INPUT!$O$9","v":"Guru Madya"}]
[145,"XII IPS-1",null,null,null,null,null,null,"2013-07-24",2013,"",null,null,null,null,null,null,null,null,null,null,null,null,null,{"$f":"+INPUT!$N$9","v":"Nanik Tri Handayani,S.Pd"},{"$f":"+INPUT!$O$9","v":"Guru Madya"}]
[146,"XII IPS-1",null,null,null,null,null,null,"2013-07-24",2013,"",null,null,null,null,null,null,null,null,null,null,null,null,null,{"$f":"+INPUT!$N$9","v":"Nanik Tri Handayani,S.Pd"},{"$f":"+INPUT!$O$9","v":"Guru Madya"}]
[147,"XII IPS-1",null,null,null,null,null,null,"2013-07-24",2013,"",null,null,null,null,null,null,null,null,null,null,null,null,null,{"$f":"+INPUT!$N$9","v":"Nanik Tri Handayani,S.Pd"},{"$f":"+INPUT!$O$9","v":"Guru Madya"}]
[148,"XII IPS-1",null,null,null,null,null,null,"2013-07-24",2013,"",null,null,null,null,null,null,null,null,null,null,null,null,null,{"$f":"+INPUT!$N$9","v":"Nanik Tri Handayani,S.Pd"},{"$f":"+INPUT!$O$9","v":"Guru Madya"}]
[149,"XII IPS-1",null,null,null,null,null,null,"2013-07-24",2013,"",null,null,null,null,null,null,null,null,null,null,null,null,null,{"$f":"+INPUT!$N$9","v":"Nanik Tri Handayani,S.Pd"},{"$f":"+INPUT!$O$9","v":"Guru Madya"}]
[150,"XII IPS-1",null,null,null,null,null,null,"2013-07-24",2013,"",null,null,null,null,null,null,null,null,null,null,null,null,null,{"$f":"+INPUT!$N$9","v":"Nanik Tri Handayani,S.Pd"},{"$f":"+INPUT!$O$9","v":"Guru Madya"}]
[151,"XII IPS-1",null,null,null,null,null,null,"2013-07-24",2013,"",null,null,null,null,null,null,null,null,null,null,null,null,null,{"$f":"+INPUT!$N$9","v":"Nanik Tri Handayani,S.Pd"},{"$f":"+INPUT!$O$9","v":"Guru Madya"}]
[152,"XII IPS-1",null,null,null,null,null,null,"2013-07-24",2013,"",null,null,null,null,null,null,null,null,null,null,null,null,null,{"$f":"+INPUT!$N$9","v":"Nanik Tri Handayani,S.Pd"},{"$f":"+INPUT!$O$9","v":"Guru Madya"}]
[153,"XII IPS-1",null,null,null,null,null,null,"2013-07-24",2013,"",null,null,null,null,null,null,null,null,null,null,null,null,null,{"$f":"+INPUT!$N$9","v":"Nanik Tri Handayani,S.Pd"},{"$f":"+INPUT!$O$9","v":"Guru Madya"}]
[154,"XII IPS-1",null,null,null,null,null,null,"2013-07-24",2013,"",null,null,null,null,null,null,null,null,null,null,null,null,null,{"$f":"+INPUT!$N$9","v":"Nanik Tri Handayani,S.Pd"},{"$f":"+INPUT!$O$9","v":"Guru Madya"}]
[155,"XII IPS-1",null,null,null,null,null,null,"2013-07-24",2013,"",null,null,null,null,null,null,null,null,null,null,null,null,null,{"$f":"+INPUT!$N$9","v":"Nanik Tri Handayani,S.Pd"},{"$f":"+INPUT!$O$9","v":"Guru Madya"}]
[156,"XII IPS-1",null,null,null,null,null,null,"2013-07-24",2013,"",null,null,null,null,null,null,null,null,null,null,null,null,null,{"$f":"+INPUT!$N$9","v":"Nanik Tri Handayani,S.Pd"},{"$f":"+INPUT!$O$9","v":"Guru Madya"}]
[157,"XII IPS-1",null,null,null,null,null,null,"2013-07-24",2013,"",null,null,null,null,null,null,null,null,null,null,null,null,null,{"$f":"+INPUT!$N$9","v":"Nanik Tri Handayani,S.Pd"},{"$f":"+INPUT!$O$9","v":"Guru Madya"}]
[158,"XII IPS-1",null,null,null,null,null,null,"2013-07-24",2013,"",null,null,null,null,null,null,null,null,null,null,null,null,null,{"$f":"+INPUT!$N$9","v":"Nanik Tri Handayani,S.Pd"},{"$f":"+INPUT!$O$9","v":"Guru Madya"}]
[159,"XII IPS-1",null,null,null,null,null,null,"2013-07-24",2013,"",null,null,null,null,null,null,null,null,null,null,null,null,null,{"$f":"+INPUT!$N$9","v":"Nanik Tri Handayani,S.Pd"},{"$f":"+INPUT!$O$9","v":"Guru Madya"}]
[160,"XII IPS-1",null,null,null,null,null,null,"2013-07-24",2013,"",null,null,null,null,null,null,null,null,null,null,null,null,null,{"$f":"+INPUT!$N$9","v":"Nanik Tri Handayani,S.Pd"},{"$f":"+INPUT!$O$9","v":"Guru Madya"}]
[161,"XII IPS-1",null,null,null,null,null,null,"2013-07-24",2013,"",null,null,null,null,null,null,null,null,null,null,null,null,null,{"$f":"+INPUT!$N$9","v":"Nanik Tri Handayani,S.Pd"},{"$f":"+INPUT!$O$9","v":"Guru Madya"}]
[162,"XII IPS-1",null,null,null,null,null,null,"2013-07-24",2013,"",null,null,null,null,null,null,null,null,null,null,null,null,null,{"$f":"+INPUT!$N$9","v":"Nanik Tri Handayani,S.Pd"},{"$f":"+INPUT!$O$9","v":"Guru Madya"}]
[163,"XII IPS-1",null,null,null,null,null,null,"2013-07-24",2013,"",null,null,null,null,null,null,null,null,null,null,null,null,null,{"$f":"+INPUT!$N$9","v":"Nanik Tri Handayani,S.Pd"},{"$f":"+INPUT!$O$9","v":"Guru Madya"}]
[164,"XII IPS-1",null,null,null,null,null,null,"2013-07-24",2013,"",null,null,null,null,null,null,null,null,null,null,null,null,null,{"$f":"+INPUT!$N$9","v":"Nanik Tri Handayani,S.Pd"},{"$f":"+INPUT!$O$9","v":"Guru Madya"}]
[165,"XII IPS-1",null,null,null,null,null,null,"2013-07-24",2013,"",null,null,null,null,null,null,null,null,null,null,null,null,null,{"$f":"+INPUT!$N$9","v":"Nanik Tri Handayani,S.Pd"},{"$f":"+INPUT!$O$9","v":"Guru Madya"}]
[166,"XII IPS-1",null,null,null,null,null,null,"2013-07-24",2013,"",null,null,null,null,null,null,null,null,null,null,null,null,null,{"$f":"+INPUT!$N$9","v":"Nanik Tri Handayani,S.Pd"},{"$f":"+INPUT!$O$9","v":"Guru Madya"}]
[167,"XII IPS-1",null,null,null,null,null,null,"2013-07-24",2013,"",null,null,null,null,null,null,null,null,null,null,null,null,null,{"$f":"+INPUT!$N$9","v":"Nanik Tri Handayani,S.Pd"},{"$f":"+INPUT!$O$9","v":"Guru Madya"}]
[168,"XII IPS-1",null,null,null,null,null,null,"2013-07-24",2013,"",null,null,null,null,null,null,null,null,null,null,null,null,null,{"$f":"+INPUT!$N$9","v":"Nanik Tri Handayani,S.Pd"},{"$f":"+INPUT!$O$9","v":"Guru Madya"}]
[169,"XII IPS-1",null,null,null,null,null,null,"2013-07-24",2013,"",null,null,null,null,null,null,null,null,null,null,null,null,null,{"$f":"+INPUT!$N$9","v":"Nanik Tri Handayani,S.Pd"},{"$f":"+INPUT!$O$9","v":"Guru Madya"}]
[170,"XII IPS-1",null,null,null,null,null,null,"2013-07-24",2013,"",null,null,null,null,null,null,null,null,null,null,null,null,null,{"$f":"+INPUT!$N$9","v":"Nanik Tri Handayani,S.Pd"},{"$f":"+INPUT!$O$9","v":"Guru Madya"}]
[171,"XII IPS-1",null,null,null,null,null,null,"2013-07-24",2013,"",null,null,null,null,null,null,null,null,null,null,null,null,null,{"$f":"+INPUT!$N$9","v":"Nanik Tri Handayani,S.Pd"},{"$f":"+INPUT!$O$9","v":"Guru Madya"}]
[172,"XII IPS-1",null,null,null,null,null,null,"2013-07-24",2013,"",null,null,null,null,null,null,null,null,null,null,null,null,null,{"$f":"+INPUT!$N$9","v":"Nanik Tri Handayani,S.Pd"},{"$f":"+INPUT!$O$9","v":"Guru Madya"}]
[173,"XII IPS-1",null,null,null,null,null,null,{"$f":"TODAY()","v":"2013-07-24"},2013,"",null,null,null,null,null,null,null,null,null,null,null,null,null,{"$f":"+INPUT!$N$9","v":"Nanik Tri Handayani,S.Pd"},{"$f":"+INPUT!$O$9","v":"Guru Madya"}]
[174,"XII IPS-1",null,null,null,null,null,null,"2013-07-24",2013,"",null,null,null,null,null,null,null,null,null,null,null,null,null,{"$f":"+INPUT!$N$9","v":"Nanik Tri Handayani,S.Pd"},{"$f":"+INPUT!$O$9","v":"Guru Madya"}]
[175,"XII IPS-1",null,null,null,null,null,null,"2013-07-24",2013,"",null,null,null,null,null,null,null,null,null,null,null,null,null,{"$f":"+INPUT!$N$9","v":"Nanik Tri Handayani,S.Pd"},{"$f":"+INPUT!$O$9","v":"Guru Madya"}]
[176,"XII IPS-1",null,null,null,null,null,null,"2013-07-24",2013,"",null,null,null,null,null,null,null,null,null,null,null,null,null,{"$f":"+INPUT!$N$9","v":"Nanik Tri Handayani,S.Pd"},{"$f":"+INPUT!$O$9","v":"Guru Madya"}]
[177,"XII IPS-1",null,null,null,null,null,null,"2013-07-24",2013,"",null,null,null,null,null,null,null,null,null,null,null,null,null,{"$f":"+INPUT!$N$9","v":"Nanik Tri Handayani,S.Pd"},{"$f":"+INPUT!$O$9","v":"Guru Madya"}]
[178,"XII IPS-1",null,null,null,null,null,null,"2013-07-24",2013,"",null,null,null,null,null,null,null,null,null,null,null,null,null,{"$f":"+INPUT!$N$9","v":"Nanik Tri Handayani,S.Pd"},{"$f":"+INPUT!$O$9","v":"Guru Madya"}]
[179,"XII IPS-1",null,null,null,null,null,null,"2013-07-24",2013,"",null,null,null,null,null,null,null,null,null,null,null,null,null,{"$f":"+INPUT!$N$9","v":"Nanik Tri Handayani,S.Pd"},{"$f":"+INPUT!$O$9","v":"Guru Madya"}]
[180,"XII IPS-1",null,null,null,null,null,null,"2013-07-24",2013,"",null,null,null,null,null,null,null,null,null,null,null,null,null,{"$f":"+INPUT!$N$9","v":"Nanik Tri Handayani,S.Pd"},{"$f":"+INPUT!$O$9","v":"Guru Madya"}]
[null,null,null,null,null,{"$f":"COUNTIF(F176:F220,\"L\")","v":1},"Laki-laki",14,"14 Th",{"$f":"+K221/$F$52*100%","v":0},{"$f":"COUNTIF(K176:K220,\"14\")","v":0},null,"BURUH HARIAN",null,null,null,null,null,null,"SMP",{"$f":"COUNTIF(U176:U220,\"SMP\")","v":1},"Islam",{"$f":"COUNTIF(W176:W220,\"Islam\")","v":1}]
[null,null,null,null,null,{"$f":"COUNTIF(F176:F220,\"P\")","v":0},"Perempuan",15,"15 Th",0,{"$f":"COUNTIF(K176:K220,\"15\")","v":0},null,"PEG / KARY. SWASTA",null,null,null,null,null,null,"MTs",{"$f":"COUNTIF(U176:U220,\"MTs\")","v":0},"Katolik",{"$f":"COUNTIF(W176:W220,\"Katolik\")","v":0}]
[null,null,null,null,null,{"$f":"SUM(F221:F222)","v":1},"Total Siswa",16,"16 Th",1,{"$f":"COUNTIF(K176:K220,\"16\")","v":1},null,"PNS",null,null,null,null,null,null,"Lainnya",{"$f":"+U221+U222","v":1},"Protestan",{"$f":"COUNTIF(W176:W220,\"Protestan\")","v":0}]
[null,null,null,null,null,null,null,17,"17 Th",0,{"$f":"COUNTIF(K176:K220,\"17\")","v":0},null,"WIRASWASTA",null,null,null,null,null,null,null,null,"Hindu",{"$f":"COUNTIF(W176:W220,\"Hindu\")","v":0}]
[null,null,null,null,null,null,null,18,"18 Th",0,{"$f":"COUNTIF(K176:K220,\"18\")","v":0},null,"KARY/ PEGAWAI .BUMN",null,null,null,null,null,null,null,null,"Budha",{"$f":"COUNTIF(W176:W220,\"Budha\")","v":0}]
[null,null,null,null,null,null,null,19,"19 Th",0,{"$f":"COUNTIF(K176:K220,\"19\")","v":0},null,"KEPOLISIAN",null,null,null,null,null,null,null,null,null,{"$f":"SUM(W221:W225)","v":1}]
[null,null,null,null,null,null,null,20,"20 Th",0,{"$f":"COUNTIF(K176:K220,\"20\")","v":0},null,"PENSIUNAN"]
[null,null,null,null,null,null,null,null,"TOTAL",1,{"$f":"SUM(K221:K227)","v":1},null,"HONORER"]
[null,null,null,null,null,null,null,null,null,null,null,null,"GURU"]
[null,null,null,null,null,null,null,null,null,null,null,null,"TAK ADA DATA"]
[null,null,null,null,null,null,null,null,null,null,null,null,"TOTAL DATA"]
[null,{"$f":"MAX(A176:A220)","v":180}]
[{"$f":"+$B$232+1","v":181},{"$f":"+INPUT!$M$10","v":"XII IPS-2"},"AGUS GUNAWAN",1112039,"9960471837","L","SERANG","1995-05-04",{"$f":"TODAY()","v":"2013-07-24"},{"$f":"+$J$3","v":2013},{"$f":"IF(H233=\"\",\"\",DATEDIF(H233,I233,\"y\"))","v":18},"HAMDI",null,null,"JL. LETJEND SOEPRAPTO KM 3 KUBANG SEPAT","DN-30-DI-0030939","DN-30 DI 2835962","2-11-30-03-021-040-9",null,2011,"SMP","087774400515","Islam",null,{"$f":"+INPUT!$N$10","v":"Nurulhijjah,S.PD"},{"$f":"+INPUT!$O$10","v":"Guru Pembina"},null,null,null,{"$f":"+B233","v":"XII IPS-2"}]
[{"$f":"+A233+1","v":182},{"$f":"IF(A234=0,\" \",+B233)","v":"XII IPS-2"},null,null,null,null,null,null,{"$f":"TODAY()","v":"2013-07-24"},2013,{"$f":"IF(H234=\"\",\"\",DATEDIF(H234,I234,\"y\"))","v":""},null,null,null,null,null,null,null,null,null,null,null,null,null,{"$f":"+INPUT!$N$10","v":"Nurulhijjah,S.PD"},{"$f":"+INPUT!$O$10","v":"Guru Pembina"}]
[183,"XII IPS-2",null,null,null,null,null,null,"2013-07-24",2013,"",null,null,null,null,null,null,null,null,null,null,null,null,null,{"$f":"+INPUT!$N$10","v":"Nurulhijjah,S.PD"},{"$f":"+INPUT!$O$10","v":"Guru Pembina"}]
[184,"XII IPS-2",null,null,null,null,null,null,"2013-07-24",2013,"",null,null,null,null,null,null,null,null,null,null,null,null,null,{"$f":"+INPUT!$N$10","v":"Nurulhijjah,S.PD"},{"$f":"+INPUT!$O$10","v":"Guru Pembina"}]
[185,"XII IPS-2",null,null,null,null,null,null,"2013-07-24",2013,"",null,null,null,null,null,null,null,null,null,null,null,null,null,{"$f":"+INPUT!$N$10","v":"Nurulhijjah,S.PD"},{"$f":"+INPUT!$O$10","v":"Guru Pembina"}]
[186,"XII IPS-2",null,null,null,null,null,null,"2013-07-24",2013,"",null,null,null,null,null,null,null,null,null,null,null,null,null,{"$f":"+INPUT!$N$10","v":"Nurulhijjah,S.PD"},{"$f":"+INPUT!$O$10","v":"Guru Pembina"}]
[187,"XII IPS-2",null,null,null,null,null,null,"2013-07-24",2013,"",null,null,null,null,null,null,null,null,null,null,null,null,null,{"$f":"+INPUT!$N$10","v":"Nurulhijjah,S.PD"},{"$f":"+INPUT!$O$10","v":"Guru Pembina"}]
[188,"XII IPS-2",null,null,null,null,null,null,"2013-07-24",2013,"",null,null,null,null,null,null,null,null,null,null,null,null,null,{"$f":"+INPUT!$N$10","v":"Nurulhijjah,S.PD"},{"$f":"+INPUT!$O$10","v":"Guru Pembina"}]
[189,"XII IPS-2",null,null,null,null,null,null,"2013-07-24",2013,"",null,null,null,null,null,null,null,null,null,null,null,null,null,{"$f":"+INPUT!$N$10","v":"Nurulhijjah,S.PD"},{"$f":"+INPUT!$O$10","v":"Guru Pembina"}]
[190,"XII IPS-2",null,null,null,null,null,null,"2013-07-24",2013,"",null,null,null,null,null,null,null,null,null,null,null,null,null,{"$f":"+INPUT!$N$10","v":"Nurulhijjah,S.PD"},{"$f":"+INPUT!$O$10","v":"Guru Pembina"}]
[191,"XII IPS-2",null,null,null,null,null,null,"2013-07-24",2013,"",null,null,null,null,null,null,null,null,null,null,null,null,null,{"$f":"+INPUT!$N$10","v":"Nurulhijjah,S.PD"},{"$f":"+INPUT!$O$10","v":"Guru Pembina"}]
[192,"XII IPS-2",null,null,null,null,null,null,"2013-07-24",2013,"",null,null,null,null,null,null,null,null,null,null,null,null,null,{"$f":"+INPUT!$N$10","v":"Nurulhijjah,S.PD"},{"$f":"+INPUT!$O$10","v":"Guru Pembina"}]
[193,"XII IPS-2",null,null,null,null,null,null,"2013-07-24",2013,"",null,null,null,null,null,null,null,null,null,null,null,null,null,{"$f":"+INPUT!$N$10","v":"Nurulhijjah,S.PD"},{"$f":"+INPUT!$O$10","v":"Guru Pembina"}]
[194,"XII IPS-2",null,null,null,null,null,null,"2013-07-24",2013,"",null,null,null,null,null,null,null,null,null,null,null,null,null,{"$f":"+INPUT!$N$10","v":"Nurulhijjah,S.PD"},{"$f":"+INPUT!$O$10","v":"Guru Pembina"}]
[195,"XII IPS-2",null,null,null,null,null,null,"2013-07-24",2013,"",null,null,null,null,null,null,null,null,null,null,null,null,null,{"$f":"+INPUT!$N$10","v":"Nurulhijjah,S.PD"},{"$f":"+INPUT!$O$10","v":"Guru Pembina"}]
[196,"XII IPS-2",null,null,null,null,null,null,"2013-07-24",2013,"",null,null,null,null,null,null,null,null,null,null,null,null,null,{"$f":"+INPUT!$N$10","v":"Nurulhijjah,S.PD"},{"$f":"+INPUT!$O$10","v":"Guru Pembina"}]
[197,"XII IPS-2",null,null,null,null,null,null,"2013-07-24",2013,"",null,null,null,null,null,null,null,null,null,null,null,null,null,{"$f":"+INPUT!$N$10","v":"Nurulhijjah,S.PD"},{"$f":"+INPUT!$O$10","v":"Guru Pembina"}]
[198,"XII IPS-2",null,null,null,null,null,null,"2013-07-24",2013,"",null,null,null,null,null,null,null,null,null,null,null,null,null,{"$f":"+INPUT!$N$10","v":"Nurulhijjah,S.PD"},{"$f":"+INPUT!$O$10","v":"Guru Pembina"}]
[199,"XII IPS-2",null,null,null,null,null,null,"2013-07-24",2013,"",null,null,null,null,null,null,null,null,null,null,null,null,null,{"$f":"+INPUT!$N$10","v":"Nurulhijjah,S.PD"},{"$f":"+INPUT!$O$10","v":"Guru Pembina"}]
[200,"XII IPS-2",null,null,null,null,null,null,"2013-07-24",2013,"",null,null,null,null,null,null,null,null,null,null,null,null,null,{"$f":"+INPUT!$N$10","v":"Nurulhijjah,S.PD"},{"$f":"+INPUT!$O$10","v":"Guru Pembina"}]
[201,"XII IPS-2",null,null,null,null,null,null,"2013-07-24",2013,"",null,null,null,null,null,null,null,null,null,null,null,null,null,{"$f":"+INPUT!$N$10","v":"Nurulhijjah,S.PD"},{"$f":"+INPUT!$O$10","v":"Guru Pembina"}]
[202,"XII IPS-2",null,null,null,null,null,null,"2013-07-24",2013,"",null,null,null,null,null,null,null,null,null,null,null,null,null,{"$f":"+INPUT!$N$10","v":"Nurulhijjah,S.PD"},{"$f":"+INPUT!$O$10","v":"Guru Pembina"}]
[203,"XII IPS-2",null,null,null,null,null,null,"2013-07-24",2013,"",null,null,null,null,null,null,null,null,null,null,null,null,null,{"$f":"+INPUT!$N$10","v":"Nurulhijjah,S.PD"},{"$f":"+INPUT!$O$10","v":"Guru Pembina"}]
[204,"XII IPS-2",null,null,null,null,null,null,"2013-07-24",2013,"",null,null,null,null,null,null,null,null,null,null,null,null,null,{"$f":"+INPUT!$N$10","v":"Nurulhijjah,S.PD"},{"$f":"+INPUT!$O$10","v":"Guru Pembina"}]
[205,"XII IPS-2",null,null,null,null,null,null,"2013-07-24",2013,"",null,null,null,null,null,null,null,null,null,null,null,null,null,{"$f":"+INPUT!$N$10","v":"Nurulhijjah,S.PD"},{"$f":"+INPUT!$O$10","v":"Guru Pembina"}]
[206,"XII IPS-2",null,null,null,null,null,null,"2013-07-24",2013,"",null,null,null,null,null,null,null,null,null,null,null,null,null,{"$f":"+INPUT!$N$10","v":"Nurulhijjah,S.PD"},{"$f":"+INPUT!$O$10","v":"Guru Pembina"}]
[207,"XII IPS-2",null,null,null,null,null,null,"2013-07-24",2013,"",null,null,null,null,null,null,null,null,null,null,null,null,null,{"$f":"+INPUT!$N$10","v":"Nurulhijjah,S.PD"},{"$f":"+INPUT!$O$10","v":"Guru Pembina"}]
[208,"XII IPS-2",null,null,null,null,null,null,"2013-07-24",2013,"",null,null,null,null,null,null,null,null,null,null,null,null,null,{"$f":"+INPUT!$N$10","v":"Nurulhijjah,S.PD"},{"$f":"+INPUT!$O$10","v":"Guru Pembina"}]
[209,"XII IPS-2",null,null,null,null,null,null,"2013-07-24",2013,"",null,null,null,null,null,null,null,null,null,null,null,null,null,{"$f":"+INPUT!$N$10","v":"Nurulhijjah,S.PD"},{"$f":"+INPUT!$O$10","v":"Guru Pembina"}]
[210,"XII IPS-2",null,null,null,null,null,null,"2013-07-24",2013,"",null,null,null,null,null,null,null,null,null,null,null,null,null,{"$f":"+INPUT!$N$10","v":"Nurulhijjah,S.PD"},{"$f":"+INPUT!$O$10","v":"Guru Pembina"}]
[211,"XII IPS-2",null,null,null,null,null,null,"2013-07-24",2013,"",null,null,null,null,null,null,null,null,null,null,null,null,null,{"$f":"+INPUT!$N$10","v":"Nurulhijjah,S.PD"},{"$f":"+INPUT!$O$10","v":"Guru Pembina"}]
[212,"XII IPS-2",null,null,null,null,null,null,"2013-07-24",2013,"",null,null,null,null,null,null,null,null,null,null,null,null,null,{"$f":"+INPUT!$N$10","v":"Nurulhijjah,S.PD"},{"$f":"+INPUT!$O$10","v":"Guru Pembina"}]
[213,"XII IPS-2",null,null,null,null,null,null,"2013-07-24",2013,"",null,null,null,null,null,null,null,null,null,null,null,null,null,{"$f":"+INPUT!$N$10","v":"Nurulhijjah,S.PD"},{"$f":"+INPUT!$O$10","v":"Guru Pembina"}]
[214,"XII IPS-2",null,null,null,null,null,null,"2013-07-24",2013,"",null,null,null,null,null,null,null,null,null,null,null,null,null,{"$f":"+INPUT!$N$10","v":"Nurulhijjah,S.PD"},{"$f":"+INPUT!$O$10","v":"Guru Pembina"}]
[215,"XII IPS-2",null,null,null,null,null,null,"2013-07-24",2013,"",null,null,null,null,null,null,null,null,null,null,null,null,null,{"$f":"+INPUT!$N$10","v":"Nurulhijjah,S.PD"},{"$f":"+INPUT!$O$10","v":"Guru Pembina"}]
[216,"XII IPS-2",null,null,null,null,null,null,"2013-07-24",2013,"",null,null,null,null,null,null,null,null,null,null,null,null,null,{"$f":"+INPUT!$N$10","v":"Nurulhijjah,S.PD"},{"$f":"+INPUT!$O$10","v":"Guru Pembina"}]
[217,"XII IPS-2",null,null,null,null,null,null,"2013-07-24",2013,"",null,null,null,null,null,null,null,null,null,null,null,null,null,{"$f":"+INPUT!$N$10","v":"Nurulhijjah,S.PD"},{"$f":"+INPUT!$O$10","v":"Guru Pembina"}]
[218,"XII IPS-2",null,null,null,null,null,null,{"$f":"TODAY()","v":"2013-07-24"},2013,"",null,null,null,null,null,null,null,null,null,null,null,null,null,{"$f":"+INPUT!$N$10","v":"Nurulhijjah,S.PD"},{"$f":"+INPUT!$O$10","v":"Guru Pembina"}]
[219,"XII IPS-2",null,null,null,null,null,null,"2013-07-24",2013,"",null,null,null,null,null,null,null,null,null,null,null,null,null,{"$f":"+INPUT!$N$10","v":"Nurulhijjah,S.PD"},{"$f":"+INPUT!$O$10","v":"Guru Pembina"}]
[220,"XII IPS-2",null,null,null,null,null,null,"2013-07-24",2013,"",null,null,null,null,null,null,null,null,null,null,null,null,null,{"$f":"+INPUT!$N$10","v":"Nurulhijjah,S.PD"},{"$f":"+INPUT!$O$10","v":"Guru Pembina"}]
[221,"XII IPS-2",null,null,null,null,null,null,"2013-07-24",2013,"",null,null,null,null,null,null,null,null,null,null,null,null,null,{"$f":"+INPUT!$N$10","v":"Nurulhijjah,S.PD"},{"$f":"+INPUT!$O$10","v":"Guru Pembina"}]
[222,"XII IPS-2",null,null,null,null,null,null,"2013-07-24",2013,"",null,null,null,null,null,null,null,null,null,null,null,null,null,{"$f":"+INPUT!$N$10","v":"Nurulhijjah,S.PD"},{"$f":"+INPUT!$O$10","v":"Guru Pembina"}]
[223,"XII IPS-2",null,null,null,null,null,null,"2013-07-24",2013,"",null,null,null,null,null,null,null,null,null,null,null,null,null,{"$f":"+INPUT!$N$10","v":"Nurulhijjah,S.PD"},{"$f":"+INPUT!$O$10","v":"Guru Pembina"}]
[224,"XII IPS-2",null,null,null,null,null,null,"2013-07-24",2013,"",null,null,null,null,null,null,null,null,null,null,null,null,null,{"$f":"+INPUT!$N$10","v":"Nurulhijjah,S.PD"},{"$f":"+INPUT!$O$10","v":"Guru Pembina"}]
[225,"XII IPS-2",null,null,null,null,null,null,"2013-07-24",2013,"",null,null,null,null,null,null,null,null,null,null,null,null,null,{"$f":"+INPUT!$N$10","v":"Nurulhijjah,S.PD"},{"$f":"+INPUT!$O$10","v":"Guru Pembina"}]
[null,null,null,null,null,{"$f":"COUNTIF(F233:F277,\"L\")","v":1},"Laki-laki",null,"14 Th",{"$f":"+K278/$F$52*100%","v":0},{"$f":"COUNTIF(K233:K277,\"14\")","v":0},null,"BURUH HARIAN",null,null,null,null,null,null,"SMP",{"$f":"COUNTIF(U233:U277,\"SMP\")","v":1},"Islam",{"$f":"COUNTIF(W233:W277,\"Islam\")","v":1},null,null,{"$f":"+INPUT!$O$10","v":"Guru Pembina"}]
[null,null,null,null,null,{"$f":"COUNTIF(F233:F277,\"P\")","v":0},"Perempuan",null,"15 Th",0,{"$f":"COUNTIF(K233:K277,\"15\")","v":0},null,"PEG / KARY. SWASTA",null,null,null,null,null,null,"MTs",{"$f":"COUNTIF(U233:U277,\"MTs\")","v":0},"Katolik",{"$f":"COUNTIF(W233:W277,\"Katolik\")","v":0},null,null,{"$f":"+INPUT!$O$10","v":"Guru Pembina"}]
[null,null,null,null,null,{"$f":"SUM(F278:F279)","v":1},"Total Siswa",null,"16 Th",0,{"$f":"COUNTIF(K233:K277,\"16\")","v":0},null,"PNS",null,null,null,null,null,null,"Lainnya",{"$f":"+U278+U279","v":1},"Protestan",{"$f":"COUNTIF(W233:W277,\"Protestan\")","v":0},null,null,{"$f":"+INPUT!$O$10","v":"Guru Pembina"}]
[null,null,null,null,null,null,null,null,"17 Th",0,{"$f":"COUNTIF(K233:K277,\"17\")","v":0},null,"WIRASWASTA",null,null,null,null,null,null,null,null,"Hindu",{"$f":"COUNTIF(W233:W277,\"Hindu\")","v":0},null,null,{"$f":"+INPUT!$O$10","v":"Guru Pembina"}]
[null,null,null,null,null,null,null,null,"18 Th",1,{"$f":"COUNTIF(K233:K277,\"18\")","v":1},null,"KARY/ PEGAWAI .BUMN",null,null,null,null,null,null,null,null,"Budha",{"$f":"COUNTIF(W233:W277,\"Budha\")","v":0},null,null,{"$f":"+INPUT!$O$10","v":"Guru Pembina"}]
[null,null,null,null,null,null,null,null,"19 Th",0,{"$f":"COUNTIF(K233:K277,\"19\")","v":0},null,"KEPOLISIAN",null,null,null,null,null,null,null,null,null,{"$f":"SUM(W278:W282)","v":1},null,null,{"$f":"+INPUT!$O$10","v":"Guru Pembina"}]
[null,null,null,null,null,null,null,null,"20 Th",0,{"$f":"COUNTIF(K233:K277,\"20\")","v":0},null,"PENSIUNAN",null,null,null,null,null,null,null,null,null,null,null,null,{"$f":"+INPUT!$O$10","v":"Guru Pembina"}]
[null,null,null,null,null,null,null,null,"TOTAL",1,{"$f":"SUM(K278:K284)","v":1},null,"HONORER",null,null,null,null,null,null,null,null,null,null,null,null,{"$f":"+INPUT!$O$10","v":"Guru Pembina"}]
[null,null,null,null,null,null,null,null,null,null,null,null,"GURU",null,null,null,null,null,null,null,null,null,null,null,null,{"$f":"+INPUT!$O$10","v":"Guru Pembina"}]
[null,null,null,null,null,null,null,null,null,null,null,null,"TAK ADA DATA",null,null,null,null,null,null,null,null,null,null,null,null,{"$f":"+INPUT!$O$10","v":"Guru Pembina"}]
[null,null,null,null,null,null,null,null,null,null,null,null,"TOTAL DATA",null,null,null,null,null,null,null,null,null,null,null,null,{"$f":"+INPUT!$O$10","v":"Guru Pembina"}]
[null,{"$f":"MAX(A233:A277)","v":225},null,null,null,null,null,null,null,null,null,null,null,null,null,null,null,null,null,null,null,null,null,null,null,{"$f":"+INPUT!$O$10","v":"Guru Pembina"}]
[{"$f":"+$B$289+1","v":226},{"$f":"+INPUT!$M$11","v":"XII IPS-3"},"ANUGRAH PRATAMA",1112006,"9960472157","L","JAKARTA","1996-07-09",{"$f":"TODAY()","v":"2013-07-24"},{"$f":"+$J$3","v":2013},{"$f":"IF(H290=\"\",\"\",DATEDIF(H290,I290,\"y\"))","v":17},"TEDDY MULYANA",null,null,"PERUMAHAN WARNASARI RT 04/07 BLOCK FWA 155 NO. 2 RT 04/07 CITANGKIL CILEGON","DN-30 DI 0029417","DN-30 DI 2836630","2-11-30-03-032-046-3",null,2011,"SMP","08129675568","Islam",null,{"$f":"+INPUT!$N$11","v":"Erning Pangesti,S.Sos"},{"$f":"+INPUT!$O$11","v":"Guru Madya Tk I"},null,null,null,{"$f":"+B290","v":"XII IPS-3"}]
[{"$f":"+A290+1","v":227},{"$f":"IF(A291=0,\" \",+B290)","v":"XII IPS-3"},null,null,null,null,null,null,{"$f":"TODAY()","v":"2013-07-24"},2013,{"$f":"IF(H291=\"\",\"\",DATEDIF(H291,I291,\"y\"))","v":""},null,null,null,null,null,null,null,null,null,null,null,null,null,{"$f":"+INPUT!$N$11","v":"Erning Pangesti,S.Sos"},{"$f":"+INPUT!$O$11","v":"Guru Madya Tk I"}]
[228,"XII IPS-3",null,null,null,null,null,null,"2013-07-24",2013,"",null,null,null,null,null,null,null,null,null,null,null,null,null,{"$f":"+INPUT!$N$11","v":"Erning Pangesti,S.Sos"},{"$f":"+INPUT!$O$11","v":"Guru Madya Tk I"}]
[229,"XII IPS-3",null,null,null,null,null,null,"2013-07-24",2013,"",null,null,null,null,null,null,null,null,null,null,null,null,null,{"$f":"+INPUT!$N$11","v":"Erning Pangesti,S.Sos"},{"$f":"+INPUT!$O$11","v":"Guru Madya Tk I"}]
[230,"XII IPS-3",null,null,null,null,null,null,"2013-07-24",2013,"",null,null,null,null,null,null,null,null,null,null,null,null,null,{"$f":"+INPUT!$N$11","v":"Erning Pangesti,S.Sos"},{"$f":"+INPUT!$O$11","v":"Guru Madya Tk I"}]
[231,"XII IPS-3",null,null,null,null,null,null,"2013-07-24",2013,"",null,null,null,null,null,null,null,null,null,null,null,null,null,{"$f":"+INPUT!$N$11","v":"Erning Pangesti,S.Sos"},{"$f":"+INPUT!$O$11","v":"Guru Madya Tk I"}]
[232,"XII IPS-3",null,null,null,null,null,null,"2013-07-24",2013,"",null,null,null,null,null,null,null,null,null,null,null,null,null,{"$f":"+INPUT!$N$11","v":"Erning Pangesti,S.Sos"},{"$f":"+INPUT!$O$11","v":"Guru Madya Tk I"}]
[233,"XII IPS-3",null,null,null,null,null,null,"2013-07-24",2013,"",null,null,null,null,null,null,null,null,null,null,null,null,null,{"$f":"+INPUT!$N$11","v":"Erning Pangesti,S.Sos"},{"$f":"+INPUT!$O$11","v":"Guru Madya Tk I"}]
[234,"XII IPS-3",null,null,null,null,null,null,"2013-07-24",2013,"",null,null,null,null,null,null,null,null,null,null,null,null,null,{"$f":"+INPUT!$N$11","v":"Erning Pangesti,S.Sos"},{"$f":"+INPUT!$O$11","v":"Guru Madya Tk I"}]
[235,"XII IPS-3",null,null,null,null,null,null,"2013-07-24",2013,"",null,null,null,null,null,null,null,null,null,null,null,null,null,{"$f":"+INPUT!$N$11","v":"Erning Pangesti,S.Sos"},{"$f":"+INPUT!$O$11","v":"Guru Madya Tk I"}]
[236,"XII IPS-3",null,null,null,null,null,null,"2013-07-24",2013,"",null,null,null,null,null,null,null,null,null,null,null,null,null,{"$f":"+INPUT!$N$11","v":"Erning Pangesti,S.Sos"},{"$f":"+INPUT!$O$11","v":"Guru Madya Tk I"}]
[237,"XII IPS-3",null,null,null,null,null,null,"2013-07-24",2013,"",null,null,null,null,null,null,null,null,null,null,null,null,null,{"$f":"+INPUT!$N$11","v":"Erning Pangesti,S.Sos"},{"$f":"+INPUT!$O$11","v":"Guru Madya Tk I"}]
[238,"XII IPS-3",null,null,null,null,null,null,"2013-07-24",2013,"",null,null,null,null,null,null,null,null,null,null,null,null,null,{"$f":"+INPUT!$N$11","v":"Erning Pangesti,S.Sos"},{"$f":"+INPUT!$O$11","v":"Guru Madya Tk I"}]
[239,"XII IPS-3",null,null,null,null,null,null,"2013-07-24",2013,"",null,null,null,null,null,null,null,null,null,null,null,null,null,{"$f":"+INPUT!$N$11","v":"Erning Pangesti,S.Sos"},{"$f":"+INPUT!$O$11","v":"Guru Madya Tk I"}]
[240,"XII IPS-3",null,null,null,null,null,null,"2013-07-24",2013,"",null,null,null,null,null,null,null,null,null,null,null,null,null,{"$f":"+INPUT!$N$11","v":"Erning Pangesti,S.Sos"},{"$f":"+INPUT!$O$11","v":"Guru Madya Tk I"}]
[241,"XII IPS-3",null,null,null,null,null,null,"2013-07-24",2013,"",null,null,null,null,null,null,null,null,null,null,null,null,null,{"$f":"+INPUT!$N$11","v":"Erning Pangesti,S.Sos"},{"$f":"+INPUT!$O$11","v":"Guru Madya Tk I"}]
[242,"XII IPS-3",null,null,null,null,null,null,"2013-07-24",2013,"",null,null,null,null,null,null,null,null,null,null,null,null,null,{"$f":"+INPUT!$N$11","v":"Erning Pangesti,S.Sos"},{"$f":"+INPUT!$O$11","v":"Guru Madya Tk I"}]
[243,"XII IPS-3",null,null,null,null,null,null,"2013-07-24",2013,"",null,null,null,null,null,null,null,null,null,null,null,null,null,{"$f":"+INPUT!$N$11","v":"Erning Pangesti,S.Sos"},{"$f":"+INPUT!$O$11","v":"Guru Madya Tk I"}]
[244,"XII IPS-3",null,null,null,null,null,null,"2013-07-24",2013,"",null,null,null,null,null,null,null,null,null,null,null,null,null,{"$f":"+INPUT!$N$11","v":"Erning Pangesti,S.Sos"},{"$f":"+INPUT!$O$11","v":"Guru Madya Tk I"}]
[245,"XII IPS-3",null,null,null,null,null,null,"2013-07-24",2013,"",null,null,null,null,null,null,null,null,null,null,null,null,null,{"$f":"+INPUT!$N$11","v":"Erning Pangesti,S.Sos"},{"$f":"+INPUT!$O$11","v":"Guru Madya Tk I"}]
[246,"XII IPS-3",null,null,null,null,null,null,"2013-07-24",2013,"",null,null,null,null,null,null,null,null,null,null,null,null,null,{"$f":"+INPUT!$N$11","v":"Erning Pangesti,S.Sos"},{"$f":"+INPUT!$O$11","v":"Guru Madya Tk I"}]
[247,"XII IPS-3",null,null,null,null,null,null,"2013-07-24",2013,"",null,null,null,null,null,null,null,null,null,null,null,null,null,{"$f":"+INPUT!$N$11","v":"Erning Pangesti,S.Sos"},{"$f":"+INPUT!$O$11","v":"Guru Madya Tk I"}]
[248,"XII IPS-3",null,null,null,null,null,null,"2013-07-24",2013,"",null,null,null,null,null,null,null,null,null,null,null,null,null,{"$f":"+INPUT!$N$11","v":"Erning Pangesti,S.Sos"},{"$f":"+INPUT!$O$11","v":"Guru Madya Tk I"}]
[249,"XII IPS-3",null,null,null,null,null,null,"2013-07-24",2013,"",null,null,null,null,null,null,null,null,null,null,null,null,null,{"$f":"+INPUT!$N$11","v":"Erning Pangesti,S.Sos"},{"$f":"+INPUT!$O$11","v":"Guru Madya Tk I"}]
[250,"XII IPS-3",null,null,null,null,null,null,"2013-07-24",2013,"",null,null,null,null,null,null,null,null,null,null,null,null,null,{"$f":"+INPUT!$N$11","v":"Erning Pangesti,S.Sos"},{"$f":"+INPUT!$O$11","v":"Guru Madya Tk I"}]
[251,"XII IPS-3",null,null,null,null,null,null,"2013-07-24",2013,"",null,null,null,null,null,null,null,null,null,null,null,null,null,{"$f":"+INPUT!$N$11","v":"Erning Pangesti,S.Sos"},{"$f":"+INPUT!$O$11","v":"Guru Madya Tk I"}]
[252,"XII IPS-3",null,null,null,null,null,null,"2013-07-24",2013,"",null,null,null,null,null,null,null,null,null,null,null,null,null,{"$f":"+INPUT!$N$11","v":"Erning Pangesti,S.Sos"},{"$f":"+INPUT!$O$11","v":"Guru Madya Tk I"}]
[253,"XII IPS-3",null,null,null,null,null,null,"2013-07-24",2013,"",null,null,null,null,null,null,null,null,null,null,null,null,null,{"$f":"+INPUT!$N$11","v":"Erning Pangesti,S.Sos"},{"$f":"+INPUT!$O$11","v":"Guru Madya Tk I"}]
[254,"XII IPS-3",null,null,null,null,null,null,"2013-07-24",2013,"",null,null,null,null,null,null,null,null,null,null,null,null,null,{"$f":"+INPUT!$N$11","v":"Erning Pangesti,S.Sos"},{"$f":"+INPUT!$O$11","v":"Guru Madya Tk I"}]
[255,"XII IPS-3",null,null,null,null,null,null,"2013-07-24",2013,"",null,null,null,null,null,null,null,null,null,null,null,null,"SRI SETYANINGSIH",{"$f":"+INPUT!$N$11","v":"Erning Pangesti,S.Sos"},{"$f":"+INPUT!$O$11","v":"Guru Madya Tk I"}]
[256,"XII IPS-3",null,null,null,null,null,null,"2013-07-24",2013,"",null,null,null,null,null,null,null,null,null,null,null,null,null,{"$f":"+INPUT!$N$11","v":"Erning Pangesti,S.Sos"},{"$f":"+INPUT!$O$11","v":"Guru Madya Tk I"}]
[257,"XII IPS-3",null,null,null,null,null,null,"2013-07-24",2013,"",null,null,null,null,null,null,null,null,null,null,null,null,null,{"$f":"+INPUT!$N$11","v":"Erning Pangesti,S.Sos"},{"$f":"+INPUT!$O$11","v":"Guru Madya Tk I"}]
[258,"XII IPS-3",null,null,null,null,null,null,"2013-07-24",2013,"",null,null,null,null,null,null,null,null,null,null,null,null,null,{"$f":"+INPUT!$N$11","v":"Erning Pangesti,S.Sos"},{"$f":"+INPUT!$O$11","v":"Guru Madya Tk I"}]
[259,"XII IPS-3",null,null,null,null,null,null,"2013-07-24",2013,"",null,null,null,null,null,null,null,null,null,null,null,null,null,{"$f":"+INPUT!$N$11","v":"Erning Pangesti,S.Sos"},{"$f":"+INPUT!$O$11","v":"Guru Madya Tk I"}]
[260,"XII IPS-3",null,null,null,null,null,null,"2013-07-24",2013,"",null,null,null,null,null,null,null,null,null,null,null,null,"ASNAWATI",{"$f":"+INPUT!$N$11","v":"Erning Pangesti,S.Sos"},{"$f":"+INPUT!$O$11","v":"Guru Madya Tk I"}]
[261,"XII IPS-3",null,null,null,null,null,null,"2013-07-24",2013,"",null,null,null,null,null,null,null,null,null,null,null,null,null,{"$f":"+INPUT!$N$11","v":"Erning Pangesti,S.Sos"},{"$f":"+INPUT!$O$11","v":"Guru Madya Tk I"}]
[262,"XII IPS-3",null,null,null,null,null,null,"2013-07-24",2013,"",null,null,null,null,null,null,null,null,null,null,null,null,null,{"$f":"+INPUT!$N$11","v":"Erning Pangesti,S.Sos"},{"$f":"+INPUT!$O$11","v":"Guru Madya Tk I"}]
[263,"XII IPS-3",null,null,null,null,null,null,{"$f":"TODAY()","v":"2013-07-24"},2013,"",null,null,null,null,null,null,null,null,null,null,null,null,null,{"$f":"+INPUT!$N$11","v":"Erning Pangesti,S.Sos"},{"$f":"+INPUT!$O$11","v":"Guru Madya Tk I"}]
[264,"XII IPS-3",null,null,null,null,null,null,"2013-07-24",2013,"",null,null,null,null,null,null,null,null,null,null,null,null,null,{"$f":"+INPUT!$N$11","v":"Erning Pangesti,S.Sos"},{"$f":"+INPUT!$O$11","v":"Guru Madya Tk I"}]
[265,"XII IPS-3",null,null,null,null,null,null,"2013-07-24",2013,"",null,null,null,null,null,null,null,null,null,null,null,null,null,{"$f":"+INPUT!$N$11","v":"Erning Pangesti,S.Sos"},{"$f":"+INPUT!$O$11","v":"Guru Madya Tk I"}]
[266,"XII IPS-3",null,null,null,null,null,null,"2013-07-24",2013,"",null,null,null,null,null,null,null,null,null,null,null,null,null,{"$f":"+INPUT!$N$11","v":"Erning Pangesti,S.Sos"},{"$f":"+INPUT!$O$11","v":"Guru Madya Tk I"}]
[267,"XII IPS-3",null,null,null,null,null,null,"2013-07-24",2013,"",null,null,null,null,null,null,null,null,null,null,null,null,null,{"$f":"+INPUT!$N$11","v":"Erning Pangesti,S.Sos"},{"$f":"+INPUT!$O$11","v":"Guru Madya Tk I"}]
[268,"XII IPS-3",null,null,null,null,null,null,"2013-07-24",2013,"",null,null,null,null,null,null,null,null,null,null,null,null,null,{"$f":"+INPUT!$N$11","v":"Erning Pangesti,S.Sos"},{"$f":"+INPUT!$O$11","v":"Guru Madya Tk I"}]
[269,"XII IPS-3",null,null,null,null,null,null,"2013-07-24",2013,"",null,null,null,null,null,null,null,null,null,null,null,null,null,{"$f":"+INPUT!$N$11","v":"Erning Pangesti,S.Sos"},{"$f":"+INPUT!$O$11","v":"Guru Madya Tk I"}]
[270,"XII IPS-3",null,null,null,null,null,null,"2013-07-24",2013,"",null,null,null,null,null,null,null,null,null,null,null,null,null,{"$f":"+INPUT!$N$11","v":"Erning Pangesti,S.Sos"},{"$f":"+INPUT!$O$11","v":"Guru Madya Tk I"}]
[null,null,null,null,null,{"$f":"COUNTIF(F290:F334,\"L\")","v":1},"Laki-laki",null,"14 Th",{"$f":"+K335/$F$52*100%","v":0},{"$f":"COUNTIF(K290:K334,\"14\")","v":0},null,"BURUH HARIAN",{"$f":"COUNTIF(N290:N334,\"BURUH HARIAN\")","v":0},null,null,null,null,null,"SMP",{"$f":"COUNTIF(U290:U334,\"SMP\")","v":1},"Islam",{"$f":"COUNTIF(W290:W334,\"Islam\")","v":1}]
[null,null,null,null,null,{"$f":"COUNTIF(F290:F334,\"P\")","v":0},"Perempuan",null,"15 Th",0,{"$f":"COUNTIF(K290:K334,\"15\")","v":0},null,"PEG / KARY. SWASTA",{"$f":"COUNTIF(N290:N334,\"PEG.SWASTA\")","v":0},null,null,null,null,null,"MTs",{"$f":"COUNTIF(U290:U334,\"MTs\")","v":0},"Katolik",{"$f":"COUNTIF(W290:W334,\"Katolik\")","v":0}]
[null,null,null,null,null,{"$f":"SUM(F335:F336)","v":1},"Total Siswa",null,"16 Th",0,{"$f":"COUNTIF(K290:K334,\"16\")","v":0},null,"PNS",{"$f":"COUNTIF(N290:N334,\"PNS\")","v":0},null,null,null,null,null,"Lainnya",{"$f":"+U335+U336","v":1},"Protestan",{"$f":"COUNTIF(W290:W334,\"Protestan\")","v":0}]
[null,null,null,null,null,null,null,null,"17 Th",1,{"$f":"COUNTIF(K290:K334,\"17\")","v":1},null,"WIRASWASTA",{"$f":"COUNTIF(N290:N334,\"WIRASWASTA\")","v":0},null,null,null,null,null,null,null,"Hindu",{"$f":"COUNTIF(W290:W334,\"Hindu\")","v":0}]
[null,null,null,null,null,null,null,null,"18 Th",0,{"$f":"COUNTIF(K290:K334,\"18\")","v":0},null,"KARY/ PEGAWAI .BUMN",{"$f":"COUNTIF(N290:N334,\"PEG/KARY. BUMN\")","v":0},null,null,null,null,null,null,null,"Budha",{"$f":"COUNTIF(W290:W334,\"Budha\")","v":0}]
[null,null,null,null,null,null,null,null,"19 Th",0,{"$f":"COUNTIF(K290:K334,\"19\")","v":0},null,"KEPOLISIAN",{"$f":"COUNTIF(N290:N334,\"KEPOLISIAN\")","v":0},null,null,null,null,null,null,null,null,{"$f":"SUM(W335:W339)","v":1}]
[null,null,null,null,null,null,null,null,"20 Th",0,{"$f":"COUNTIF(K290:K334,\"20\")","v":0},null,"PENSIUNAN",{"$f":"COUNTIF(N290:N334,\"PENSIUNAN\")","v":0}]
[null,null,null,null,null,null,null,null,"TOTAL",1,{"$f":"SUM(K335:K341)","v":1},null,"HONORER",{"$f":"COUNTIF(N290:N334,\"HONORER\")","v":0}]
[null,null,null,null,null,null,null,null,null,null,null,null,"GURU",{"$f":"COUNTIF(N290:N334,\"GURU\")","v":0}]
[null,null,null,null,null,null,null,null,null,null,null,null,"TAK ADA DATA",{"$f":"COUNTIF(N290:N334,\"TAK ADA DATA\")","v":0}]
[null,null,null,null,null,null,null,null,null,null,null,null,"TOTAL DATA",{"$f":"SUM(N335:N344)","v":0}]
[null,{"$f":"MAX(A290:A334)","v":270}]
[]
[]
[null,null,"Data Kosong",{"$f":"COUNTBLANK(D5:D347)","v":337},{"$f":"COUNTBLANK(E5:E347)","v":337},{"$f":"+F50+F107+F164+F221+F278+F335","v":4},"L",null,"14 Th",{"$f":"+K349/$F$351*100%","v":0},{"$f":"+K50+K107+K164+K221+K278+K335","v":0},null,null,null,null,{"$f":"COUNTBLANK(P3:P231)","v":224},{"$f":"COUNTBLANK(Q3:Q231)","v":226},{"$f":"COUNTBLANK(R3:R231)","v":224},null,"SMPN-L",{"$f":"COUNTIF(U5:U347,\"SMPN-L\")","v":0},{"$f":"+U349+U350","v":0},{"$f":"COUNTIF(W3:W347,\"Islam\")","v":7}]
[{"$f":"COUNTA(A5:A334)-1&\"  Siswa\"","v":"269  Siswa"},null,"Data Terisi",{"$f":"COUNTA(D5:D347)","v":6},{"$f":"COUNTA(E5:E347)","v":6},{"$f":"+F51+F108+F165+F222+F279+F336","v":2},"P",null,"15 Th",0,0,null,{"$f":"COUNTBLANK(M3:M231)","v":184},null,null,"Ijazah lagi",null,"SKHUN lagi",null,"SMP-L",{"$f":"COUNTIF(U5:U347,\"SMP-L\")","v":0},null,{"$f":"COUNTIF(W3:W347,\"Kristen Katolik\")","v":0}]
[null,"KELAS","PENDAPATAN ORANG TUA","AGAMA",null,{"$f":"SUM(F349:F350)","v":6},"Laki-laki & Perempuan",null,"16 Th",0.16666666666666666,1,null,"BURUH HARIAN",{"$f":"COUNTIF(N5:N346,\"BURUH HARIAN\")","v":0},{"$f":"+N351/$F$351*100%","v":0},null,null,null,null,"SMPN-P",{"$f":"COUNTIF(U5:U347,\"SMPN-P\")","v":0},{"$f":"+U351+U352","v":0},{"$f":"COUNTIF(W3:W347,\"Kristen Protestan\")","v":0}]
[null,"X-1","Rp 500 - 700 Ribu","Islam",null,null,null,null,"17 Th",0.66666666666666663,4,null,"PEG / KARY. SWASTA",{"$f":"COUNTIF(N5:N346,\"PEG.SWASTA\")","v":0},0,null,null,null,null,"SMP-P",{"$f":"COUNTIF(U5:U347,\"SMP-P\")","v":0},null,{"$f":"COUNTIF(W3:W347,\"Hindu\")","v":0}]
[null,"X-2","Rp 1.000.000 - 1.500.000 Ribu","Katolik",null,null,"LULUSAN",null,"18 Th",0.16666666666666666,1,null,"PNS",{"$f":"COUNTIF(N5:N346,\"PNS\")","v":0},0,null,null,null,null,"MTs-L",{"$f":"COUNTIF(U5:U347,\"MTSN-L\")","v":0},{"$f":"+U353+U354","v":0},{"$f":"COUNTIF(W3:W347,\"Budha\")","v":0}]
[null,"X-3","Rp 2.000.000 -2500.000 Ribu","Protestan",null,null,"SMP",null,"19 Th",0,0,null,"WIRASWASTA",{"$f":"COUNTIF(N5:N346,\"WIRASWASTA\")","v":0},0,null,null,null,null,"MTSN-L",{"$f":"COUNTIF(U5:U347,\"MTS-L\")","v":0},null,{"$f":"SUM(W349:W353)","v":7}]
[null,"X-4","Rp 3000.000 -Ke atas","Hindu",null,null,"MTS",null,"20 Th",0,0,null,"KARY/ PEGAWAI .BUMN",{"$f":"COUNTIF(N5:N346,\"PEG/KARY. BUMN\")","v":0},0,null,null,null,null,"MTs-P",{"$f":"COUNTIF(U5:U347,\"MTSN-P\")","v":0},{"$f":"+U355+U356","v":0}]
[null,"X-5",null,"Budha",null,null,"Lainnya",null,"TOTAL",{"$f":"SUM(J349:J355)","v":0.99999999999999989},{"$f":"SUM(K349:K355)","v":6},null,"KEPOLISIAN",{"$f":"COUNTIF(N5:N346,\"KEPOLISIAN\")","v":0},0,null,null,null,null,"MTSN-P",{"$f":"COUNTIF(U5:U347,\"MTS-P\")","v":0}]
[null,"X-6","ASAL SEKOLAH",null,null,null,null,null,null,null,null,null,"PENSIUNAN",{"$f":"COUNTIF(N5:N346,\"PENSIUNAN\")","v":0},0,null,null,null,null,null,{"$f":"SUM(U349:U356)","v":0}]
[null,"XI-IPA 1","SMPN 1 CILEGON",null,null,null,null,null,null,null,null,null,"HONORER",{"$f":"COUNTIF(N5:N346,\"HONORER\")","v":0},0]
[null,"XI-IPA 2","SMPN 2 CILEGON",null,null,null,null,null,null,null,null,null,"GURU",{"$f":"COUNTIF(N5:N346,\"GURU\")","v":0},0]
[null,"XI-IPA 3","SMPN 3 CILEGON",null,null,null,null,null,null,null,null,null,"TAK ADA DATA",{"$f":"COUNTIF(N5:N346,\"TAK ADA DATA\")","v":0},0]
[null,"XI-IPS 1","SMPN 4 CILEGON"]
[null,"XI-IPS 2","SMPN 5 CILEGON",null,null,null,null,null,null,null,null,null,"TOTAL DATA",{"$f":"SUM(N351:N361)&\" Orang\"","v":"0 Orang"},{"$f":"SUM(O351:O360)","v":0}]
[null,"XI-IPS 3","SMPN 6 CILEGON"]
[null,"XII-IPA 1","SMPN 7 CILEGON"]
[null,"XII-IPA 2","SMPN 8 CILEGON"]
[null,"XII-IPA 3","SMPN 9 CILEGON"]
[null,"XII-IPS 1","SMPN 10 CILEGON"]
[null,"XII-IPS 2","SMPN 11 CILEGON"]
[null,"XII-IPS 3","SMP MADINATUL HADIED"]
[null,null,"SMP 17 CLG"]
[null,null,"SMP AL-ISHLAH"]
[null,null,"SMP Daar El Falaah"]
[null,null,"SMP FATAHILAH"]
[null,null,"SMP KS"]
[null,null,"SMP MARDIYUANA "]
[null,null,"SMP MUHAMADIYAH TALANGPADANG"]
[null,null,"SMP MUHAMMADIYAH CILEGON"]
[null,null,"SMP NUR EL FALAH"]
[null,null,"SMP PGRI 2 CITANGKIL"]
[null,null,"SMP RAUDATHUL JANNAH"]
[null,null,"SMP YAPMU"]
[null,null,"SMPN 1 ANYAR"]
[null,null,"SMPN 1 CIPANAS"]
[null,null,"SMPN 1 KALIANDA"]
[null,null,"SMPN 1 MANCAK"]
[null,null,"SMPN 2 ABUNG TINGGI"]
[null,null,"SMPN 2 MANCAK"]
[null,null,"SMPN 3 RAMBATAN"]
[null,null,"MTS AL-BUSTANIYAH"]
[null,null,"MTS AL-BUSTANIYAH"]
[null,null,"MTS AL-HASYIMIYAH"]
[null,null,"MTS AL-HIDAYAH"]
[null,null,"MTS AL-I'ANAH"]
[null,null,"MTS AL-INAYAH"]
[null,null,"MTS AL-ITMAM"]
[null,null,"MTS AL-JAUHAROTUNNAQIYYAH PALAS"]
[null,null,"MTS AL-KH PABUARAN"]
[null,null,"MTS AL-KH PEKALONGAN"]
[null,null,"MTS AL-KHAIRIYAH CITANGKIL"]
[null,null,"MTS AL-KHAIRIYAH KOTA SARI"]
[null,null,"MTS AL-KHAIRIYAH KUBANGSARI"]
[null,null,"MTS ALKH-KRACAK"]
[null,null,"MTS BANI NAWAI"]
[null,null,"MTS DARUSYSYIFA"]
[null,null,"MTS HIKMATUL ULUM"]
[null,null,"MTs MATHLAUL FALAH"]
[null,null,"MTS NURUL KALAM"]
[null,null,"MTS TANGERANG"]
[null,null,"MTS TANGERANG"]
[null,null,"MTSN ANYAR"]
[null,null,"MTSN CILEGON"]
[null,null,"MTSN CIWANDAN"]
[null,null,"LAINNYA"]
[null,null,null,null,null,null,null,null,null,null,null,"Wanita 13",{"$f":"SUMPRODUCT(($F$5:$F$334=\"P\")*($K$5:$K$334=13))","v":0}]
[null,null,null,null,null,null,null,null,null,null,null,"Pria 13",{"$f":"SUMPRODUCT(($F$5:$F$334=\"L\")*($K$5:$K$334=13))","v":0}]
[null,null,null,null,null,null,null,null,null,null,null,"Wanita 14",{"$f":"SUMPRODUCT(($F$5:$F$334=\"P\")*($K$5:$K$334=14))","v":0}]
[null,null,null,null,null,null,null,null,null,null,null,"Pria 14",{"$f":"SUMPRODUCT(($F$5:$F$334=\"L\")*($K$5:$K$334=14))","v":0}]
[null,null,null,null,null,null,null,null,null,null,null,"Wanita 15",{"$f":"SUMPRODUCT(($F$5:$F$334=\"P\")*($K$5:$K$334=15))","v":0}]
[null,null,null,null,null,null,null,null,null,null,null,"Pria 15",{"$f":"SUMPRODUCT(($F$5:$F$334=\"L\")*($K$5:$K$334=15))","v":0}]
[null,null,null,null,null,null,null,null,null,null,null,"Wanita 16",{"$f":"SUMPRODUCT(($F$5:$F$334=\"P\")*($K$5:$K$334=16))","v":0}]
[null,null,null,null,null,null,null,null,null,null,null,"Pria 16",{"$f":"SUMPRODUCT(($F$5:$F$334=\"L\")*($K$5:$K$334=16))","v":1}]
[null,null,null,null,null,null,null,null,null,null,null,"Wanita 17",{"$f":"SUMPRODUCT(($F$5:$F$334=\"P\")*($K$5:$K$334=17))","v":2}]
[null,null,null,null,null,null,null,null,null,null,null,"Pria 17",{"$f":"SUMPRODUCT(($F$5:$F$334=\"L\")*($K$5:$K$334=17))","v":2}]
[null,null,null,null,null,null,null,null,null,null,null,"Wanita 18",{"$f":"SUMPRODUCT(($F$5:$F$334=\"P\")*($K$5:$K$334=18))","v":0}]
[null,null,null,null,null,null,null,null,null,null,null,"Pria 18",{"$f":"SUMPRODUCT(($F$5:$F$334=\"L\")*($K$5:$K$334=18))","v":1}]
[null,null,null,null,null,null,null,null,null,null,null,"Wanita 19",{"$f":"SUMPRODUCT(($F$5:$F$334=\"P\")*($K$5:$K$334=19))","v":0}]
[null,null,null,null,null,null,null,null,null,null,null,"Pria 19",{"$f":"SUMPRODUCT(($F$5:$F$334=\"L\")*($K$5:$K$334=19))","v":0}]
[null,null,null,null,null,null,null,null,null,null,null,"Wanita 20",{"$f":"SUMPRODUCT(($F$5:$F$334=\"P\")*($K$5:$K$334=20))","v":0}]
[null,null,null,null,null,null,null,null,null,null,null,"Pria 20",{"$f":"SUMPRODUCT(($F$5:$F$334=\"L\")*($K$5:$K$334=20))","v":0}]
[null,null,null,null,null,null,null,null,null,null,null,"Wanita 21",{"$f":"SUMPRODUCT(($F$5:$F$334=\"P\")*($K$5:$K$334=21))","v":0}]
[null,null,null,null,null,null,null,null,null,null,null,"Pria 21",{"$f":"SUMPRODUCT(($F$5:$F$334=\"L\")*($K$5:$K$334=21))","v":0}]
[null,null,null,null,null,null,null,null,null,null,null,"Wanita 22",{"$f":"SUMPRODUCT(($F$5:$F$334=\"P\")*($K$5:$K$334=22))","v":0}]
[null,null,null,null,null,null,null,null,null,null,null,"Pria 22",{"$f":"SUMPRODUCT(($F$5:$F$334=\"L\")*($K$5:$K$334=22))","v":0}]
[null,null,null,null,null,null,null,null,null,null,null,"Wanita 23",{"$f":"SUMPRODUCT(($F$5:$F$334=\"P\")*($K$5:$K$334=23))","v":0}]
[null,null,null,null,null,null,null,null,null,null,null,"Pria 23",{"$f":"SUMPRODUCT(($F$5:$F$334=\"L\")*($K$5:$K$334=23))","v":0}]
[null,null,null,null,null,null,null,null,null,null,null,"Wanita 24",{"$f":"SUMPRODUCT(($F$5:$F$334=\"P\")*($K$5:$K$334=24))","v":0}]
[null,null,null,null,null,null,null,null,null,null,null,"Pria 24",{"$f":"SUMPRODUCT(($F$5:$F$334=\"L\")*($K$5:$K$334=24))","v":0}]
[null,null,null,null,null,null,null,null,null,null,null,"Wanita 25",{"$f":"SUMPRODUCT(($F$5:$F$334=\"P\")*($K$5:$K$334=25))","v":0}]
[null,null,null,null,null,null,null,null,null,null,null,"Pria 25",{"$f":"SUMPRODUCT(($F$5:$F$334=\"L\")*($K$5:$K$334=25))","v":0}]
[null,null,null,null,null,null,null,null,null,null,null,null,{"$f":"SUM(M414:M439)&\"  Siswa \"","v":"6  Siswa "}]

{"sheet":"Absen-X","index":6,"n_rows":388,"n_cols":22,"rows_kept":388,"cut":false,"hidden":false,"merged":[[0,0,5,0],[0,2,0,31],[1,2,1,31],[2,2,2,31],[4,2,5,2],[4,3,5,3],[4,4,5,4],[4,5,5,5],[4,6,4,31],[74,2,74,31],[6,2,6,31],[56,20,56,30],[57,20,57,30],[68,2,68,31],[69,2,69,31],[70,2,70,31],[72,2,73,2],[72,3,73,3],[72,4,73,4],[72,5,73,5],[72,6,72,31],[135,2,136,2],[135,3,136,3],[135,4,136,4],[135,5,136,5],[135,6,135,31],[122,20,122,30],[123,20,123,30],[131,2,131,31],[132,2,132,31],[133,2,133,31],[204,2,204,31],[137,2,137,31],[186,20,186,30],[187,20,187,30],[198,2,198,31],[199,2,199,31],[200,2,200,31],[202,2,203,2],[202,3,203,3],[202,4,203,4],[202,5,203,5],[202,6,202,31],[334,2,334,31],[252,21,252,31],[253,21,253,31],[265,2,265,31],[266,2,266,31],[267,2,267,31],[269,2,270,2],[269,3,270,3],[269,4,270,4],[269,5,270,5],[269,6,269,31],[271,2,271,31],[319,20,319,30],[320,20,320,30],[332,2,332,31],[333,2,333,31],[386,20,386,30],[387,20,387,30],[336,2,337,2],[336,3,337,3],[336,4,337,4],[336,5,337,5],[336,6,336,31],[338,2,338,31]]}
["NO URUT DATABASE",null,"DAFTAR HADIR SISWA"]
[null,null,{"$f":"+MENU!$D$8","v":"SMA NEGERI 5 CILEGON"}]
[null,null,{"$f":"CONCATENATE(MENU!$C$7,\" \",MENU!$D$7)","v":"TAHUN AJARAN 2013-2014"}]
[null,null,"KELAS",null,{"$f":"IF(ISBLANK(A8),\"\",VLOOKUP(A8,Data1,2))","v":"X-1"}]
[null,null,"NO","NIS","NAMA","L/P","Tanggal"]
[]
[]
[{"$f":"+'DataBase-XI'!A5","v":1},{"$f":"IF(ISBLANK(A8),\"\",VLOOKUP(A8,Data1,2))","v":"X-1"},1,{"$f":"IF(ISBLANK(A8),\"\",VLOOKUP(A8,Data1,5))","v":9970456061},{"$f":"IF(ISBLANK(A8),\"\",VLOOKUP(A8,Data1,3))","v":"ALVIRA"},{"$f":"IF(ISBLANK(A8),\"\",VLOOKUP(A8,Data1,6))","v":"P"}]
[2,"X-1",2,0,0,0]
[3,"X-1",3,0,0,0]
[4,"X-1",4,0,0,0]
[5,"X-1",5,0,0,0]
[6,"X-1",6,0,0,0]
[7,"X-1",7,0,0,0]
[8,"X-1",8,0,0,0]
[9,"X-1",9,0,0,0]
[10,"X-1",10,0,0,0]
[11,"X-1",11,0,0,0]
[12,"X-1",12,0,0,0]
[13,"X-1",13,0,0,0]
[14,"X-1",14,0,0,0]
[15,"X-1",15,0,0,0]
[16,"X-1",16,0,0,0]
[17,"X-1",17,0,0,0]
[18,"X-1",18,0,0,0]
[19,"X-1",19,0,0,0]
[20,"X-1",20,0,0,0]
[21,"X-1",21,0,0,0]
[22,"X-1",22,0,0,0]
[23,"X-1",23,0,0,0]
[24,"X-1",24,0,0,0]
[25,"X-1",25,0,0,0]
[26,"X-1",26,0,0,0]
[27,"X-1",27,0,0,0]
[28,"X-1",28,0,0,0]
[29,"X-1",29,0,0,0]
[30,"X-1",30,0,0,0]
[31,"X-1",31,0,0,0]
[32,"X-1",32,0,0,0]
[33,"X-1",33,0,0,0]
[34,"X-1",34,0,0,0]
[35,"X-1",35,0,0,0]
[36,"X-1",36,0,0,0]
[37,"X-1",37,0,0,0]
[38,"X-1",38,0,0,0]
[39,"X-1",39,0,0,0]
[40,"X-1",40]
[]
[{"$f":"MAX(A8:A47)","v":40},null,null,null,"Jumlah Laki-laki",{"$f":"COUNTIF(F8:F47,\"L\")","v":0},null,null,null,null,null,null,null,null,null,null,null,null,null,null,"Cilegon,…………………………….20"]
[null,null,null,null,"Jumlah Perempuan",{"$f":"COUNTIF(F8:F47,\"P\")","v":1},null,null,null,null,null,null,null,null,null,null,null,null,null,null,"Guru Bidang Studi"]
[null,null,null,null,"Jumlah Total",{"$f":"SUM(F49:F50)","v":1}]
[]
[]
[]
[]
[]
[null,null,null,null,null,null,null,null,null,null,null,null,null,null,null,null,null,null,null,null,"(……………………...……….)"]
[null,null,null,null,null,null,null,null,null,null,null,null,null,null,null,null,null,null,null,null,"NIP:……………………………………."]
[]
[]
[]
[]
[]
[]
[]
[]
[]
[]
[null,null,"DAFTAR HADIR SISWA"]
[null,null,{"$f":"+MENU!$D$8","v":"SMA NEGERI 5 CILEGON"}]
[null,null,{"$f":"CONCATENATE(MENU!$C$7,\" \",MENU!$D$7)","v":"TAHUN AJARAN 2013-2014"}]
[null,null,"KELAS",null,{"$f":"IF(ISBLANK(A76),\"\",VLOOKUP(A76,Data1,2))","v":"X-2"}]
[null,null,"NO","NIS","NAMA","L/P","Tanggal"]
[]
[]
[{"$f":"+'DataBase-XI'!A62","v":46},{"$f":"IF(ISBLANK(A76),\"\",VLOOKUP(A76,Data1,2))","v":"X-2"},1,{"$f":"IF(ISBLANK(A76),\"\",VLOOKUP(A76,Data1,5))","v":9980450357},{"$f":"IF(ISBLANK(A76),\"\",VLOOKUP(A76,Data1,3))","v":"ADITYA YUDISTIRA"},{"$f":"IF(ISBLANK(A76),\"\",VLOOKUP(A76,Data1,6))","v":"L"}]
[{"$f":"+A76+1","v":47},"X-2",2,0,0,0]
[48,"X-2",3,0,0,0]
[49,"X-2",4,0,0,0]
[50,"X-2",5,0,0,0]
[51,"X-2",6,0,0,0]
[52,"X-2",7,0,0,0]
[53,"X-2",8,0,0,0]
[54,"X-2",9,0,0,0]
[55,"X-2",10,0,0,0]
[56,"X-2",11,0,0,0]
[57,"X-2",12,0,0,0]
[58,"X-2",13,0,0,0]
[59,"X-2",14,0,0,0]
[60,"X-2",15,0,0,0]
[61,"X-2",16,0,0,0]
[62,"X-2",17,0,0,0]
[63,"X-2",18,0,0,0]
[64,"X-2",19,0,0,0]
[65,"X-2",20,0,0,0]
[66,"X-2",21,0,0,0]
[67,"X-2",22,0,0,0]
[68,"X-2",23,0,0,0]
[69,"X-2",24,0,0,0]
[70,"X-2",25,0,0,0]
[71,"X-2",26,0,0,0]
[72,"X-2",27,0,0,0]
[73,"X-2",28,0,0,0]
[74,"X-2",29,0,0,0]
[75,"X-2",30,0,0,0]
[76,"X-2",31,0,0,0]
[77,"X-2",32,0,0,0]
[78,"X-2",33,0,0,0]
[79,"X-2",34,0,0,0]
[80,"X-2",35,0,0,0]
[81,"X-2",36,0,0,0]
[82,"X-2",37,0,0,0]
[83,"X-2",38,0,0,0]
[84,"X-2",39,0,0,0]
[85,"X-2",40,0,0,0]
[]
[{"$f":"MAX(A76:A113)","v":83},null,null,null,"Jumlah Laki-laki",{"$f":"COUNTIF(F76:F115,\"L\")","v":1},null,null,null,null,null,null,null,null,null,null,null,null,null,null,"Cilegon,…………………………….20"]
[null,null,null,null,"Jumlah Perempuan",{"$f":"COUNTIF(F76:F115,\"P\")","v":0},null,null,null,null,null,null,null,null,null,null,null,null,null,null,"Guru Bidang Studi"]
[null,null,null,null,"Jumlah Total",{"$f":"SUM(F117:F118)","v":1}]
[]
[]
[]
[null,null,null,null,null,null,null,null,null,null,null,null,null,null,null,null,null,null,null,null,"(……………………...……….)"]
[null,null,null,null,null,null,null,null,null,null,null,null,null,null,null,null,null,null,null,null,"NIP:……………………………………."]
[]
[]
[]
[]
[]
[]
[]
[null,null,"DAFTAR HADIR SISWA"]
[null,null,{"$f":"+MENU!$D$8","v":"SMA NEGERI 5 CILEGON"}]
[null,null,{"$f":"CONCATENATE(MENU!$C$7,\" \",MENU!$D$7)","v":"TAHUN AJARAN 2013-2014"}]
[null,null,"KELAS",null,{"$f":"IF(ISBLANK(A139),\"\",VLOOKUP(A139,Data1,2))","v":"X-3"}]
[null,null,"NO","NIS","NAMA","L/P","Tanggal"]
[]
[]
[{"$f":"+'DataBase-XI'!A119","v":91},{"$f":"IF(ISBLANK(A139),\"\",VLOOKUP(A139,Data1,2))","v":"X-3"},1,{"$f":"IF(ISBLANK(A139),\"\",VLOOKUP(A139,Data1,5))","v":9988413542},{"$f":"IF(ISBLANK(A139),\"\",VLOOKUP(A139,Data1,3))","v":"ADE SRI JUA ASIH"},{"$f":"IF(ISBLANK(A139),\"\",VLOOKUP(A139,Data1,6))","v":"P"}]
[{"$f":"+A139+1","v":92},"X-3",2,0,0,0]
[93,"X-3",3,0,0,0]
[94,"X-3",4,0,0,0]
[95,"X-3",5,0,0,0]
[96,"X-3",6,0,0,0]
[97,"X-3",7,0,0,0]
[98,"X-3",8,0,0,0]
[99,"X-3",9,0,0,0]
[100,"X-3",10,0,0,0]
[101,"X-3",11,0,0,0]
[102,"X-3",12,0,0,0]
[103,"X-3",13,0,0,0]
[104,"X-3",14,0,0,0]
[105,"X-3",15,0,0,0]
[106,"X-3",16,0,0,0]
[107,"X-3",17,0,0,0]
[108,"X-3",18,0,0,0]
[109,"X-3",19,0,0,0]
[110,"X-3",20,0,0,0]
[111,"X-3",21,0,0,0]
[112,"X-3",22,0,0,0]
[113,"X-3",23,0,0,0]
[114,"X-3",24,0,0,0]
[115,"X-3",25,0,0,0]
[116,"X-3",26,0,0,0]
[117,"X-3",27,0,0,0]
[118,"X-3",28,0,0,0]
[119,"X-3",29,0,0,0]
[120,"X-3",30,0,0,0]
[121,"X-3",31,0,0,0]
[122,"X-3",32,0,0,0]
[123,"X-3",33,0,0,0]
[124,"X-3",34,0,0,0]
[125,"X-3",35,0,0,0]
[126,"X-3",36,0,0,0]
[127,"X-3",37,0,0,0]
[128,"X-3",38,0,0,0]
[129,"X-3",39,0,0,0]
[130,"X-3",40,0,0,0]
[]
[{"$f":"MAX(A139:A177)","v":129},null,null,null,"Jumlah Laki-laki",{"$f":"COUNTIF(F139:F178,\"L\")","v":0},null,null,null,null,null,null,null,null,null,null,null,null,null,null,"Cilegon,…………………………….20"]
[null,null,null,null,"Jumlah Perempuan",{"$f":"COUNTIF(F139:F178,\"P\")","v":1},null,null,null,null,null,null,null,null,null,null,null,null,null,null,"Guru Bidang Studi"]
[null,null,null,null,"Jumlah Total",{"$f":"SUM(F180:F181)","v":1}]
[]
[]
[]
[]
[null,null,null,null,null,null,null,null,null,null,null,null,null,null,null,null,null,null,null,null,"(……………………...……….)"]
[null,null,null,null,null,null,null,null,null,null,null,null,null,null,null,null,null,null,null,null,"NIP:……………………………………."]
[]
[]
[]
[]
[]
[]
[]
[]
[]
[]
[null,null,"DAFTAR HADIR SISWA"]
[null,null,{"$f":"+MENU!$D$8","v":"SMA NEGERI 5 CILEGON"}]
[null,null,{"$f":"CONCATENATE(MENU!$C$7,\" \",MENU!$D$7)","v":"TAHUN AJARAN 2013-2014"}]
[null,null,"KELAS",null,{"$f":"IF(ISBLANK(A206),\"\",VLOOKUP(A206,Data1,2))","v":"X-4"}]
[null,null,"NO","NIS","NAMA","L/P","Tanggal"]
[]
[]
[{"$f":"+'DataBase-XI'!A176","v":136},{"$f":"IF(ISBLANK(A206),\"\",VLOOKUP(A206,Data1,2))","v":"X-4"},1,{"$f":"IF(ISBLANK(A206),\"\",VLOOKUP(A206,Data1,5))","v":"9980450221"},{"$f":"IF(ISBLANK(A206),\"\",VLOOKUP(A206,Data1,3))","v":"ADE ISWANDI"},{"$f":"IF(ISBLANK(A206),\"\",VLOOKUP(A206,Data1,6))","v":"L"}]
[{"$f":"+A206+1","v":137},"X-4",2,0,0,0]
[138,"X-4",3,0,0,0]
[139,"X-4",4,0,0,0]
[140,"X-4",5,0,0,0]
[141,"X-4",6,0,0,0]
[142,"X-4",7,0,0,0]
[143,"X-4",8,0,0,0]
[144,"X-4",9,0,0,0]
[145,"X-4",10,0,0,0]
[146,"X-4",11,0,0,0]
[147,"X-4",12,0,0,0]
[148,"X-4",13,0,0,0]
[149,"X-4",14,0,0,0]
[150,"X-4",15,0,0,0]
[151,"X-4",16,0,0,0]
[152,"X-4",17,0,0,0]
[153,"X-4",18,0,0,0]
[154,"X-4",19,0,0,0]
[155,"X-4",20,0,0,0]
[156,"X-4",21,0,0,0]
[157,"X-4",22,0,0,0]
[158,"X-4",23,0,0,0]
[159,"X-4",24,0,0,0]
[160,"X-4",25,0,0,0]
[161,"X-4",26,0,0,0]
[162,"X-4",27,0,0,0]
[163,"X-4",28,0,0,0]
[164,"X-4",29,0,0,0]
[165,"X-4",30,0,0,0]
[166,"X-4",31,0,0,0]
[167,"X-4",32,0,0,0]
[168,"X-4",33,0,0,0]
[169,"X-4",34,0,0,0]
[170,"X-4",35,0,0,0]
[171,"X-4",36,0,0,0]
[172,"X-4",37,0,0,0]
[173,"X-4",38,0,0,0]
[174,"X-4",39,0,0,0]
[175,"X-4",40,0,0,0]
[]
[{"$f":"MAX(A206:A244)","v":174},null,null,null,"Jumlah Laki-laki",{"$f":"COUNTIF(F206:F245,\"L\")","v":1},null,null,null,null,null,null,null,null,null,null,null,null,null,null,null,"Cilegon,…………………………….20"]
[null,null,null,null,"Jumlah Perempuan",{"$f":"COUNTIF(F206:F245,\"P\")","v":0},null,null,null,null,null,null,null,null,null,null,null,null,null,null,null,"Guru Bidang Studi"]
[null,null,null,null,"Jumlah Total",{"$f":"SUM(F247:F248)","v":1}]
[]
[]
[]
[null,null,null,null,null,null,null,null,null,null,null,null,null,null,null,null,null,null,null,null,null,"(……………………...……….)"]
[null,null,null,null,null,null,null,null,null,null,null,null,null,null,null,null,null,null,null,null,null,"NIP:……………………………………."]
[]
[]
[]
[]
[]
[]
[]
[]
[]
[]
[]
[null,null,"DAFTAR HADIR SISWA"]
[null,null,{"$f":"+MENU!$D$8","v":"SMA NEGERI 5 CILEGON"}]
[null,null,{"$f":"CONCATENATE(MENU!$C$7,\" \",MENU!$D$7)","v":"TAHUN AJARAN 2013-2014"}]
[null,null,"KELAS",null,{"$f":"IF(ISBLANK(A273),\"\",VLOOKUP(A273,Data1,2))","v":"X-5"}]
[null,null,"NO","NIS","NAMA","L/P","Tanggal"]
[]
[]
[{"$f":"+'DataBase-XI'!A233","v":181},{"$f":"IF(ISBLANK(A273),\"\",VLOOKUP(A273,Data1,2))","v":"X-5"},1,{"$f":"IF(ISBLANK(A273),\"\",VLOOKUP(A273,Data1,5))","v":"9985058275"},{"$f":"IF(ISBLANK(A273),\"\",VLOOKUP(A273,Data1,3))","v":"ABDUS SALAM"},{"$f":"IF(ISBLANK(A273),\"\",VLOOKUP(A273,Data1,6))","v":"L"}]
[{"$f":"+A273+1","v":182},"X-5",2,0,0,0]
[183,"X-5",3,0,0,0]
[184,"X-5",4,0,0,0]
[185,"X-5",5,0,0,0]
[186,"X-5",6,0,0,0]
[187,"X-5",7,0,0,0]
[188,"X-5",8,0,0,0]
[189,"X-5",9,0,0,0]
[190,"X-5",10,0,0,0]
[191,"X-5",11,0,0,0]
[192,"X-5",12,0,0,0]
[193,"X-5",13,0,0,0]
[194,"X-5",14,0,0,0]
[195,"X-5",15,0,0,0]
[196,"X-5",16,0,0,0]
[197,"X-5",17,0,0,0]
[198,"X-5",18,0,0,0]
[199,"X-5",19,0,0,0]
[200,"X-5",20,0,0,0]
[201,"X-5",21,0,0,0]
[202,"X-5",22,0,0,0]
[203,"X-5",23,0,0,0]
[204,"X-5",24,0,0,0]
[205,"X-5",25,0,0,0]
[206,"X-5",26,0,0,0]
[207,"X-5",27,0,0,0]
[208,"X-5",28,0,0,0]
[209,"X-5",29,0,0,0]
[210,"X-5",30,0,0,0]
[211,"X-5",31,0,0,0]
[212,"X-5",32,0,0,0]
[213,"X-5",33,0,0,0]
[214,"X-5",34,0,0,0]
[215,"X-5",35,0,0,0]
[216,"X-5",36,0,0,0]
[217,"X-5",37,0,0,0]
[218,"X-5",38,0,0,0]
[219,"X-5",39,0,0,0]
[220,"X-5",40,0,0,0]
[]
[{"$f":"MAX(A273:A312)","v":220},null,null,null,"Jumlah Laki-laki",{"$f":"COUNTIF(F272:F312,\"L\")","v":1},null,null,null,null,null,null,null,null,null,null,null,null,null,null,"Cilegon,…………………………….20"]
[null,null,null,null,"Jumlah Perempuan",{"$f":"COUNTIF(F272:F312,\"P\")","v":0},null,null,null,null,null,null,null,null,null,null,null,null,null,null,"Guru Bidang Studi"]
[null,null,null,null,"Jumlah Total",{"$f":"SUM(F314:F315)","v":1}]
[]
[]
[]
[null,null,null,null,null,null,null,null,null,null,null,null,null,null,null,null,null,null,null,null,"(……………………...……….)"]
[null,null,null,null,null,null,null,null,null,null,null,null,null,null,null,null,null,null,null,null,"NIP:……………………………………."]
[]
[]
[]
[]
[]
[]
[]
[]
[]
[]
[]
[null,null,"DAFTAR HADIR SISWA"]
[null,null,{"$f":"+MENU!$D$8","v":"SMA NEGERI 5 CILEGON"}]
[null,null,{"$f":"CONCATENATE(MENU!$C$7,\" \",MENU!$D$7)","v":"TAHUN AJARAN 2013-2014"}]
[null,null,"KELAS",null,{"$f":"IF(ISBLANK(A340),\"\",VLOOKUP(A340,Data1,2))","v":"X-6"}]
[null,null,"NO","NIS","NAMA","L/P","Tanggal"]
[]
[]
[{"$f":"+'DataBase-XI'!A290","v":226},{"$f":"IF(ISBLANK(A340),\"\",VLOOKUP(A340,Data1,2))","v":"X-6"},1,{"$f":"IF(ISBLANK(A340),\"\",VLOOKUP(A340,Data1,5))","v":"9980452259"},{"$f":"IF(ISBLANK(A340),\"\",VLOOKUP(A340,Data1,3))","v":"ABDUL GOFUR"},{"$f":"IF(ISBLANK(A340),\"\",VLOOKUP(A340,Data1,6))","v":"L"}]
[{"$f":"+A340+1","v":227},"X-6",2,0,0,0]
[228,"X-6",3,0,0,0]
[229,"X-6",4,0,0,0]
[230,"X-6",5,0,0,0]
[231,"X-6",6,0,0,0]
[232,"X-6",7,0,0,0]
[233,"X-6",8,0,0,0]
[234,"X-6",9,0,0,0]
[235,"X-6",10,0,0,0]
[236,"X-6",11,0,0,0]
[237,"X-6",12,0,0,0]
[238,"X-6",13,0,0,0]
[239,"X-6",14,0,0,0]
[240,"X-6",15,0,0,0]
[241,"X-6",16,0,0,0]
[242,"X-6",17,0,0,0]
[243,"X-6",18,0,0,0]
[244,"X-6",19,0,0,0]
[245,"X-6",20,0,0,0]
[246,"X-6",21,0,0,0]
[247,"X-6",22,0,0,0]
[248,"X-6",23,0,0,0]
[249,"X-6",24,0,0,0]
[250,"X-6",25,0,0,0]
[251,"X-6",26,0,0,0]
[252,"X-6",27,0,0,0]
[253,"X-6",28,0,0,0]
[254,"X-6",29,0,0,0]
[255,"X-6",30,0,0,0]
[256,"X-6",31,0,0,0]
[257,"X-6",32,0,0,0]
[258,"X-6",33,0,0,0]
[259,"X-6",34,0,0,0]
[260,"X-6",35,0,0,0]
[261,"X-6",null,0,0,0]
[262,"X-6",null,0,0,0]
[263,"X-6",null,0,0,0]
[264,"X-6",null,0,0,0]
[265,"X-6",null,0,0,0]
[]
[null,null,null,null,"Jumlah Laki-laki",{"$f":"COUNTIF(F339:F379,\"L\")","v":1},null,null,null,null,null,null,null,null,null,null,null,null,null,null,"Cilegon,…………………………….20"]
[null,null,null,null,"Jumlah Perempuan",{"$f":"COUNTIF(F339:F379,\"P\")","v":0},null,null,null,null,null,null,null,null,null,null,null,null,null,null,"Guru Bidang Studi"]
[null,null,null,null,"Jumlah Total",{"$f":"SUM(F381:F382)","v":1}]
[]
[]
[]
[null,null,null,null,null,null,null,null,null,null,null,null,null,null,null,null,null,null,null,null,"(……………………...……….)"]
[null,null,null,null,null,null,null,null,null,null,null,null,null,null,null,null,null,null,null,null,"NIP:……………………………………."]

{"sheet":"Raport-X","index":7,"n_rows":349,"n_cols":10,"rows_kept":349,"cut":false,"hidden":false,"merged":[[0,0,5,0],[0,2,0,9],[1,2,1,9],[2,2,2,9],[4,2,5,2],[4,3,5,3],[4,4,5,4],[4,5,5,5],[4,6,4,8],[4,9,5,9],[6,2,6,9],[60,2,60,9],[61,2,61,9],[62,2,62,9],[64,2,65,2],[64,3,65,3],[64,4,65,4],[64,5,65,5],[64,6,64,8],[64,9,65,9],[66,2,66,9],[118,2,118,9],[119,2,119,9],[120,2,120,9],[122,2,123,2],[122,3,123,3],[122,4,123,4],[122,5,123,5],[122,6,122,8],[122,9,123,9],[124,2,124,9],[178,2,178,9],[179,2,179,9],[180,2,180,9],[182,2,183,2],[182,3,183,3],[182,4,183,4],[182,5,183,5],[182,6,182,8],[182,9,183,9],[184,2,184,9],[238,2,238,9],[239,2,239,9],[240,2,240,9],[242,2,243,2],[242,3,243,3],[242,4,243,4],[242,5,243,5],[242,6,242,8],[242,9,243,9],[304,2,304,9],[244,2,244,9],[298,2,298,9],[299,2,299,9],[300,2,300,9],[302,2,303,2],[302,3,303,3],[302,4,303,4],[302,5,303,5],[302,6,302,8],[302,9,303,9]]}
["NO URUT DATABASE",null,"DAFTAR NILAI SISWA"]
[null,null,{"$f":"+MENU!$D$8","v":"SMA NEGERI 5 CILEGON"}]
[null,null,{"$f":"CONCATENATE(MENU!$C$7,\" \",MENU!$D$7)","v":"TAHUN AJARAN 2013-2014"}]
[null,null,"KELAS",null,{"$f":"IF(ISBLANK(A8),\"\",VLOOKUP(A8,Data1,2))","v":"X-1"}]
[null,null,"NO","NIS","NAMA","L/P","NILAI RAPORT",null,null,"KET"]
[null,null,null,null,null,null,"Kognitif","Afektif","Psikomotor"]
[]
[{"$f":"+'DataBase-XI'!A5","v":1},{"$f":"IF(ISBLANK(A8),\"\",VLOOKUP(A8,Data1,2))","v":"X-1"},1,{"$f":"IF(ISBLANK(A8),\"\",VLOOKUP(A8,Data1,5))","v":9970456061},{"$f":"IF(ISBLANK(A8),\"\",VLOOKUP(A8,Data1,3))","v":"ALVIRA"},{"$f":"IF(ISBLANK(A8),\"\",VLOOKUP(A8,Data1,6))","v":"P"}]
[2,"X-1",2,0,0,0]
[3,"X-1",3,0,0,0]
[4,"X-1",4,0,0,0]
[5,"X-1",5,0,0,0]
[6,"X-1",6,0,0,0]
[7,"X-1",7,0,0,0]
[8,"X-1",8,0,0,0]
[9,"X-1",9,0,0,0]
[10,"X-1",10,0,0,0]
[11,"X-1",11,0,0,0]
[12,"X-1",12,0,0,0]
[13,"X-1",13,0,0,0]
[14,"X-1",14,0,0,0]
[15,"X-1",15,0,0,0]
[16,"X-1",16,0,0,0]
[17,"X-1",17,0,0,0]
[18,"X-1",18,0,0,0]
[19,"X-1",19,0,0,0]
[20,"X-1",20,0,0,0]
[21,"X-1",21,0,0,0]
[22,"X-1",22,0,0,0]
[23,"X-1",23,0,0,0]
[24,"X-1",24,0,0,0]
[25,"X-1",25,0,0,0]
[26,"X-1",26,0,0,0]
[27,"X-1",27,0,0,0]
[28,"X-1",28,0,0,0]
[29,"X-1",29,0,0,0]
[30,"X-1",30,0,0,0]
[31,"X-1",31,0,0,0]
[32,"X-1",32,0,0,0]
[33,"X-1",33,0,0,0]
[34,"X-1",34,0,0,0]
[35,"X-1",35,0,0,0]
[36,"X-1",36,0,0,0]
[37,"X-1",37,0,0,0]
[38,"X-1",38,0,0,0]
[39,"X-1",39,0,0,0]
[40,"X-1",40]
[]
[{"$f":"MAX(A8:A47)","v":40},null,null,null,"Jumlah Laki-laki",{"$f":"COUNTIF(F8:F47,\"L\")","v":0}]
[null,null,null,null,"Jumlah Perempuan",{"$f":"COUNTIF(F8:F47,\"P\")","v":1}]
[null,null,null,null,"Jumlah Total",{"$f":"SUM(F49:F50)","v":1}]
[]
[]
[]
[]
[]
[]
[]
[]
[]
[null,null,"DAFTAR NILAI SISWA"]
[null,null,{"$f":"+MENU!$D$8","v":"SMA NEGERI 5 CILEGON"}]
[null,null,{"$f":"CONCATENATE(MENU!$C$7,\" \",MENU!$D$7)","v":"TAHUN AJARAN 2013-2014"}]
[null,null,"KELAS",null,{"$f":"IF(ISBLANK(A68),\"\",VLOOKUP(A68,Data1,2))","v":"X-2"}]
[null,null,"NO","NIS","NAMA","L/P","NILAI RAPORT",null,null,"KET"]
[null,null,null,null,null,null,"Kognitif","Afektif","Psikomotor"]
[]
[{"$f":"+'DataBase-XI'!A62","v":46},{"$f":"IF(ISBLANK(A68),\"\",VLOOKUP(A68,Data1,2))","v":"X-2"},1,{"$f":"IF(ISBLANK(A68),\"\",VLOOKUP(A68,Data1,5))","v":9980450357},{"$f":"IF(ISBLANK(A68),\"\",VLOOKUP(A68,Data1,3))","v":"ADITYA YUDISTIRA"},{"$f":"IF(ISBLANK(A68),\"\",VLOOKUP(A68,Data1,6))","v":"L"}]
[{"$f":"+A68+1","v":47},"X-2",2,0,0,0]
[48,"X-2",3,0,0,0]
[49,"X-2",4,0,0,0]
[50,"X-2",5,0,0,0]
[51,"X-2",6,0,0,0]
[52,"X-2",7,0,0,0]
[53,"X-2",8,0,0,0]
[54,"X-2",9,0,0,0]
[55,"X-2",10,0,0,0]
[56,"X-2",11,0,0,0]
[57,"X-2",12,0,0,0]
[58,"X-2",13,0,0,0]
[59,"X-2",14,0,0,0]
[60,"X-2",15,0,0,0]
[61,"X-2",16,0,0,0]
[62,"X-2",17,0,0,0]
[63,"X-2",18,0,0,0]
[64,"X-2",19,0,0,0]
[65,"X-2",20,0,0,0]
[66,"X-2",21,0,0,0]
[67,"X-2",22,0,0,0]
[68,"X-2",23,0,0,0]
[69,"X-2",24,0,0,0]
[70,"X-2",25,0,0,0]
[71,"X-2",26,0,0,0]
[72,"X-2",27,0,0,0]
[73,"X-2",28,0,0,0]
[74,"X-2",29,0,0,0]
[75,"X-2",30,0,0,0]
[76,"X-2",31,0,0,0]
[77,"X-2",32,0,0,0]
[78,"X-2",33,0,0,0]
[79,"X-2",34,0,0,0]
[80,"X-2",35,0,0,0]
[81,"X-2",36,0,0,0]
[82,"X-2",37,0,0,0]
[83,"X-2",38,0,0,0]
[84,"X-2",39,0,0,0]
[85,"X-2",40,0,0,0]
[]
[{"$f":"MAX(A68:A105)","v":83},null,null,null,"Jumlah Laki-laki",{"$f":"COUNTIF(F68:F107,\"L\")","v":1}]
[null,null,null,null,"Jumlah Perempuan",{"$f":"COUNTIF(F68:F107,\"P\")","v":0}]
[null,null,null,null,"Jumlah Total",{"$f":"SUM(F109:F110)","v":1}]
[]
[]
[]
[]
[]
[]
[]
[null,null,"DAFTAR NILAI SISWA"]
[null,null,{"$f":"+MENU!$D$8","v":"SMA NEGERI 5 CILEGON"}]
[null,null,{"$f":"CONCATENATE(MENU!$C$7,\" \",MENU!$D$7)","v":"TAHUN AJARAN 2013-2014"}]
[null,null,"KELAS",null,{"$f":"IF(ISBLANK(A126),\"\",VLOOKUP(A126,Data1,2))","v":"X-3"}]
[null,null,"NO","NIS","NAMA","L/P","NILAI RAPORT",null,null,"KET"]
[null,null,null,null,null,null,"Kognitif","Afektif","Psikomotor"]
[]
[{"$f":"+'DataBase-XI'!A119","v":91},{"$f":"IF(ISBLANK(A126),\"\",VLOOKUP(A126,Data1,2))","v":"X-3"},1,{"$f":"IF(ISBLANK(A126),\"\",VLOOKUP(A126,Data1,5))","v":9988413542},{"$f":"IF(ISBLANK(A126),\"\",VLOOKUP(A126,Data1,3))","v":"ADE SRI JUA ASIH"},{"$f":"IF(ISBLANK(A126),\"\",VLOOKUP(A126,Data1,6))","v":"P"}]
[{"$f":"+A126+1","v":92},"X-3",2,0,0,0]
[93,"X-3",3,0,0,0]
[94,"X-3",4,0,0,0]
[95,"X-3",5,0,0,0]
[96,"X-3",6,0,0,0]
[97,"X-3",7,0,0,0]
[98,"X-3",8,0,0,0]
[99,"X-3",9,0,0,0]
[100,"X-3",10,0,0,0]
[101,"X-3",11,0,0,0]
[102,"X-3",12,0,0,0]
[103,"X-3",13,0,0,0]
[104,"X-3",14,0,0,0]
[105,"X-3",15,0,0,0]
[106,"X-3",16,0,0,0]
[107,"X-3",17,0,0,0]
[108,"X-3",18,0,0,0]
[109,"X-3",19,0,0,0]
[110,"X-3",20,0,0,0]
[111,"X-3",21,0,0,0]
[112,"X-3",22,0,0,0]
[113,"X-3",23,0,0,0]
[114,"X-3",24,0,0,0]
[115,"X-3",25,0,0,0]
[116,"X-3",26,0,0,0]
[117,"X-3",27,0,0,0]
[118,"X-3",28,0,0,0]
[119,"X-3",29,0,0,0]
[120,"X-3",30,0,0,0]
[121,"X-3",31,0,0,0]
[122,"X-3",32,0,0,0]
[123,"X-3",33,0,0,0]
[124,"X-3",34,0,0,0]
[125,"X-3",35,0,0,0]
[126,"X-3",36,0,0,0]
[127,"X-3",37,0,0,0]
[128,"X-3",38,0,0,0]
[129,"X-3",39,0,0,0]
[130,"X-3",40,0,0,0]
[]
[{"$f":"MAX(A126:A164)","v":129},null,null,null,"Jumlah Laki-laki",{"$f":"COUNTIF(F126:F165,\"L\")","v":0}]
[null,null,null,null,"Jumlah Perempuan",{"$f":"COUNTIF(F126:F165,\"P\")","v":1}]
[null,null,null,null,"Jumlah Total",{"$f":"SUM(F167:F168)","v":1}]
[]
[]
[]
[]
[]
[]
[]
[]
[]
[null,null,"DAFTAR NILAI SISWA"]
[null,null,{"$f":"+MENU!$D$8","v":"SMA NEGERI 5 CILEGON"}]
[null,null,{"$f":"CONCATENATE(MENU!$C$7,\" \",MENU!$D$7)","v":"TAHUN AJARAN 2013-2014"}]
[null,null,"KELAS",null,{"$f":"IF(ISBLANK(A186),\"\",VLOOKUP(A186,Data1,2))","v":"X-4"}]
[null,null,"NO","NIS","NAMA","L/P","NILAI RAPORT",null,null,"KET"]
[null,null,null,null,null,null,"Kognitif","Afektif","Psikomotor"]
[]
[{"$f":"+'DataBase-XI'!A176","v":136},{"$f":"IF(ISBLANK(A186),\"\",VLOOKUP(A186,Data1,2))","v":"X-4"},1,{"$f":"IF(ISBLANK(A186),\"\",VLOOKUP(A186,Data1,5))","v":"9980450221"},{"$f":"IF(ISBLANK(A186),\"\",VLOOKUP(A186,Data1,3))","v":"ADE ISWANDI"},{"$f":"IF(ISBLANK(A186),\"\",VLOOKUP(A186,Data1,6))","v":"L"}]
[{"$f":"+A186+1","v":137},"X-4",2,0,0,0]
[138,"X-4",3,0,0,0]
[139,"X-4",4,0,0,0]
[140,"X-4",5,0,0,0]
[141,"X-4",6,0,0,0]
[142,"X-4",7,0,0,0]
[143,"X-4",8,0,0,0]
[144,"X-4",9,0,0,0]
[145,"X-4",10,0,0,0]
[146,"X-4",11,0,0,0]
[147,"X-4",12,0,0,0]
[148,"X-4",13,0,0,0]
[149,"X-4",14,0,0,0]
[150,"X-4",15,0,0,0]
[151,"X-4",16,0,0,0]
[152,"X-4",17,0,0,0]
[153,"X-4",18,0,0,0]
[154,"X-4",19,0,0,0]
[155,"X-4",20,0,0,0]
[156,"X-4",21,0,0,0]
[157,"X-4",22,0,0,0]
[158,"X-4",23,0,0,0]
[159,"X-4",24,0,0,0]
[160,"X-4",25,0,0,0]
[161,"X-4",26,0,0,0]
[162,"X-4",27,0,0,0]
[163,"X-4",28,0,0,0]
[164,"X-4",29,0,0,0]
[165,"X-4",30,0,0,0]
[166,"X-4",31,0,0,0]
[167,"X-4",32,0,0,0]
[168,"X-4",33,0,0,0]
[169,"X-4",34,0,0,0]
[170,"X-4",35,0,0,0]
[171,"X-4",36,0,0,0]
[172,"X-4",37,0,0,0]
[173,"X-4",38,0,0,0]
[174,"X-4",39,0,0,0]
[175,"X-4",40,0,0,0]
[]
[{"$f":"MAX(A186:A224)","v":174},null,null,null,"Jumlah Laki-laki",{"$f":"COUNTIF(F186:F225,\"L\")","v":1}]
[null,null,null,null,"Jumlah Perempuan",{"$f":"COUNTIF(F186:F225,\"P\")","v":0}]
[null,null,null,null,"Jumlah Total",{"$f":"SUM(F227:F228)","v":1}]
[]
[]
[]
[]
[]
[]
[]
[]
[]
[null,null,"DAFTAR NILAI SISWA"]
[null,null,{"$f":"+MENU!$D$8","v":"SMA NEGERI 5 CILEGON"}]
[null,null,{"$f":"CONCATENATE(MENU!$C$7,\" \",MENU!$D$7)","v":"TAHUN AJARAN 2013-2014"}]
[null,null,"KELAS",null,{"$f":"IF(ISBLANK(A246),\"\",VLOOKUP(A246,Data1,2))","v":"X-5"}]
[null,null,"NO","NIS","NAMA","L/P","NILAI RAPORT",null,null,"KET"]
[null,null,null,null,null,null,"Kognitif","Afektif","Psikomotor"]
[]
[{"$f":"+'DataBase-XI'!A233","v":181},{"$f":"IF(ISBLANK(A246),\"\",VLOOKUP(A246,Data1,2))","v":"X-5"},1,{"$f":"IF(ISBLANK(A246),\"\",VLOOKUP(A246,Data1,5))","v":"9985058275"},{"$f":"IF(ISBLANK(A246),\"\",VLOOKUP(A246,Data1,3))","v":"ABDUS SALAM"},{"$f":"IF(ISBLANK(A246),\"\",VLOOKUP(A246,Data1,6))","v":"L"}]
[{"$f":"+A246+1","v":182},"X-5",2,0,0,0]
[183,"X-5",3,0,0,0]
[184,"X-5",4,0,0,0]
[185,"X-5",5,0,0,0]
[186,"X-5",6,0,0,0]
[187,"X-5",7,0,0,0]
[188,"X-5",8,0,0,0]
[189,"X-5",9,0,0,0]
[190,"X-5",10,0,0,0]
[191,"X-5",11,0,0,0]
[192,"X-5",12,0,0,0]
[193,"X-5",13,0,0,0]
[194,"X-5",14,0,0,0]
[195,"X-5",15,0,0,0]
[196,"X-5",16,0,0,0]
[197,"X-5",17,0,0,0]
[198,"X-5",18,0,0,0]
[199,"X-5",19,0,0,0]
[200,"X-5",20,0,0,0]
[201,"X-5",21,0,0,0]
[202,"X-5",22,0,0,0]
[203,"X-5",23,0,0,0]
[204,"X-5",24,0,0,0]
[205,"X-5",25,0,0,0]
[206,"X-5",26,0,0,0]
[207,"X-5",27,0,0,0]
[208,"X-5",28,0,0,0]
[209,"X-5",29,0,0,0]
[210,"X-5",30,0,0,0]
[211,"X-5",31,0,0,0]
[212,"X-5",32,0,0,0]
[213,"X-5",33,0,0,0]
[214,"X-5",34,0,0,0]
[215,"X-5",35,0,0,0]
[216,"X-5",36,0,0,0]
[217,"X-5",37,0,0,0]
[218,"X-5",38,0,0,0]
[219,"X-5",39,0,0,0]
[220,"X-5",40,0,0,0]
[]
[{"$f":"MAX(A246:A285)","v":220},null,null,null,"Jumlah Laki-laki",{"$f":"COUNTIF(F245:F285,\"L\")","v":1}]
[null,null,null,null,"Jumlah Perempuan",{"$f":"COUNTIF(F245:F285,\"P\")","v":0}]
[null,null,null,null,"Jumlah Total",{"$f":"SUM(F287:F288)","v":1}]
[]
[]
[]
[]
[]
[]
[]
[]
[]
[null,null,"DAFTAR NILAI SISWA"]
[null,null,{"$f":"+MENU!$D$8","v":"SMA NEGERI 5 CILEGON"}]
[null,null,{"$f":"CONCATENATE(MENU!$C$7,\" \",MENU!$D$7)","v":"TAHUN AJARAN 2013-2014"}]
[null,null,"KELAS",null,{"$f":"IF(ISBLANK(A306),\"\",VLOOKUP(A306,Data1,2))","v":"X-6"}]
[null,null,"NO","NIS","NAMA","L/P","NILAI RAPORT",null,null,"KET"]
[null,null,null,null,null,null,"Kognitif","Afektif","Psikomotor"]
[]
[{"$f":"+'DataBase-XI'!A290","v":226},{"$f":"IF(ISBLANK(A306),\"\",VLOOKUP(A306,Data1,2))","v":"X-6"},1,{"$f":"IF(ISBLANK(A306),\"\",VLOOKUP(A306,Data1,5))","v":"9980452259"},{"$f":"IF(ISBLANK(A306),\"\",VLOOKUP(A306,Data1,3))","v":"ABDUL GOFUR"},{"$f":"IF(ISBLANK(A306),\"\",VLOOKUP(A306,Data1,6))","v":"L"}]
[{"$f":"+A306+1","v":227},"X-6",2,0,0,0]
[228,"X-6",3,0,0,0]
[229,"X-6",4,0,0,0]
[230,"X-6",5,0,0,0]
[231,"X-6",6,0,0,0]
[232,"X-6",7,0,0,0]
[233,"X-6",8,0,0,0]
[234,"X-6",9,0,0,0]
[235,"X-6",10,0,0,0]
[236,"X-6",11,0,0,0]
[237,"X-6",12,0,0,0]
[238,"X-6",13,0,0,0]
[239,"X-6",14,0,0,0]
[240,"X-6",15,0,0,0]
[241,"X-6",16,0,0,0]
[242,"X-6",17,0,0,0]
[243,"X-6",18,0,0,0]
[244,"X-6",19,0,0,0]
[245,"X-6",20,0,0,0]
[246,"X-6",21,0,0,0]
[247,"X-6",22,0,0,0]
[248,"X-6",23,0,0,0]
[249,"X-6",24,0,0,0]
[250,"X-6",25,0,0,0]
[251,"X-6",26,0,0,0]
[252,"X-6",27,0,0,0]
[253,"X-6",28,0,0,0]
[254,"X-6",29,0,0,0]
[255,"X-6",30,0,0,0]
[256,"X-6",31,0,0,0]
[257,"X-6",32,0,0,0]
[258,"X-6",33,0,0,0]
[259,"X-6",34,0,0,0]
[260,"X-6",35,0,0,0]
[261,"X-6",null,0,0,0]
[262,"X-6",null,0,0,0]
[263,"X-6",null,0,0,0]
[264,"X-6",null,0,0,0]
[265,"X-6",null,0,0,0]
[]
[null,null,null,null,"Jumlah Laki-laki",{"$f":"COUNTIF(F305:F345,\"L\")","v":1}]
[null,null,null,null,"Jumlah Perempuan",{"$f":"COUNTIF(F305:F345,\"P\")","v":0}]
[null,null,null,null,"Jumlah Total",{"$f":"SUM(F347:F348)","v":1}]

{"sheet":"Blanko-Daf Nilai X","index":8,"n_rows":380,"n_cols":18,"rows_kept":380,"cut":false,"hidden":false,"merged":[[0,0,8,0],[0,2,0,15],[1,2,1,15],[2,2,2,15],[6,2,8,2],[6,3,8,3],[6,4,8,4],[6,5,8,5],[6,6,7,11],[6,12,8,12],[6,13,7,14],[6,15,8,15],[64,2,64,15],[65,2,65,15],[66,2,66,15],[70,13,71,14],[70,15,72,15],[134,4,136,4],[134,5,136,5],[134,6,135,11],[134,12,136,12],[70,12,72,12],[128,2,128,15],[129,2,129,15],[130,2,130,15],[70,2,72,2],[70,3,72,3],[70,4,72,4],[70,5,72,5],[70,6,71,11],[198,15,200,15],[256,2,256,15],[257,2,257,15],[258,2,258,15],[134,13,135,14],[134,15,136,15],[192,2,192,15],[193,2,193,15],[194,2,194,15],[198,2,200,2],[198,3,200,3],[198,4,200,4],[198,5,200,5],[198,6,199,11],[134,2,136,2],[134,3,136,3],[262,5,264,5],[262,6,263,11],[262,12,264,12],[198,12,200,12],[198,13,199,14],[326,12,328,12],[326,13,327,14],[326,15,328,15],[262,13,263,14],[262,15,264,15],[320,2,320,15],[321,2,321,15],[322,2,322,15],[326,2,328,2],[326,3,328,3],[326,4,328,4],[326,5,328,5],[326,6,327,11],[262,2,264,2],[262,3,264,3],[262,4,264,4]]}
["NO URUT DATABASE",null,"DAFTAR NILAI MURNI"]
[null,null,{"$f":"+MENU!$D$8","v":"SMA NEGERI 5 CILEGON"}]
[null,null,{"$f":"CONCATENATE(MENU!$C$7,\" \",MENU!$D$7)","v":"TAHUN AJARAN 2013-2014"}]
[]
[null,null,"MATA PELAJARAN",null,";",null,null,null,null,null,null,null,"Kelas/Semester:",null,null,{"$f":"+B10","v":"X-1"}]
[null,null,"NAMA SEKOLAH",null,{"$f":"+$C$2","v":"SMA NEGERI 5 CILEGON"}]
[null,null,"NO","NAMA SISWA","NISN","L/P","NILAI HARIAN / TUGAS",null,null,null,null,null,"RATA-RATA","KETUNTASAN",null,"KET"]
[]
[null,null,null,null,null,null,1,2,3,4,5,6,null,"YA","TIDAK"]
[{"$f":"+'DataBase-XI'!A5","v":1},{"$f":"IF(ISBLANK(A10),\"\",VLOOKUP(A10,Data1,2))","v":"X-1"},1,{"$f":"IF(ISBLANK(A10),\"\",VLOOKUP(A10,Data1,3))","v":"ALVIRA"},{"$f":"IF(ISBLANK(A10),\"\",VLOOKUP(A10,Data1,5))","v":9970456061},{"$f":"IF(ISBLANK(A10),\"\",VLOOKUP(A10,Data1,6))","v":"P"}]
[2,"X-1",2,0,0,0]
[3,"X-1",3,0,0,0]
[4,"X-1",4,0,0,0]
[5,"X-1",5,0,0,0]
[6,"X-1",6,0,0,0]
[7,"X-1",7,0,0,0]
[8,"X-1",8,0,0,0]
[9,"X-1",9,0,0,0]
[10,"X-1",10,0,0,0]
[11,"X-1",11,0,0,0]
[12,"X-1",12,0,0,0]
[13,"X-1",13,0,0,0]
[14,"X-1",14,0,0,0]
[15,"X-1",15,0,0,0]
[16,"X-1",16,0,0,0]
[17,"X-1",17,0,0,0]
[18,"X-1",18,0,0,0]
[19,"X-1",19,0,0,0]
[20,"X-1",20,0,0,0]
[21,"X-1",21,0,0,0]
[22,"X-1",22,0,0,0]
[23,"X-1",23,0,0,0]
[24,"X-1",24,0,0,0]
[25,"X-1",25,0,0,0]
[26,"X-1",26,0,0,0]
[27,"X-1",27,0,0,0]
[28,"X-1",28,0,0,0]
[29,"X-1",29,0,0,0]
[30,"X-1",30,0,0,0]
[31,"X-1",31,0,0,0]
[32,"X-1",32,0,0,0]
[33,"X-1",33,0,0,0]
[34,"X-1",34,0,0,0]
[35,"X-1",35,0,0,0]
[36,"X-1",36,0,0,0]
[37,"X-1",37,0,0,0]
[38,"X-1",38,0,0,0]
[39,"X-1",39,0,0,0]
[40,"X-1",40,0,0,0]
[null,null,null,"Mengetahui",null,null,null,null,null,null,null,null,{"$f":"CONCATENATE(MENU!$D$13,\" ,   \",R50)","v":"Cilegon ,   24 Juli 2013"},null,null,null,null,{"$f":"TEXT(NOW(),\"dd mmmm yyyy\")","v":"24 Juli 2013"}]
[{"$f":"MAX(A10:A47)","v":38},null,null,"Waka Kurikulum",null,null,null,null,null,null,null,null,"Guru Bidang Study"]
[]
[]
[null,null,null,"................................",null,null,null,null,null,null,null,null,"................................"]
[null,null,null,"NIP: ",null,null,"Mengetahui",null,null,null,null,null,"NIP: "]
[null,null,null,null,null,null,"Kepala Sekolah"]
[]
[]
[null,null,null,null,null,null,{"$f":"+[1]MENU!$C$16","v":"Asep Mansur,S.Pd"}]
[null,null,null,null,null,null,{"$f":"+[1]MENU!$C$17","v":"NIP: 19620101 198512 1 004"}]
[]
[]
[]
[]
[null,null,"DAFTAR NILAI MURNI"]
[null,null,{"$f":"+$C$2","v":"SMA NEGERI 5 CILEGON"}]
[null,null,{"$f":"+$C$3","v":"TAHUN AJARAN 2013-2014"}]
[]
[null,null,"MATA PELAJARAN",null,";",null,null,null,null,null,null,null,"Kelas/Semester:",null,null,{"$f":"+B74","v":"X-2"}]
[null,null,"NAMA SEKOLAH",null,{"$f":"+$C$2","v":"SMA NEGERI 5 CILEGON"}]
[null,null,"NO","NAMA SISWA","NISN","L/P","NILAI HARIAN / TUGAS",null,null,null,null,null,"RATA-RATA","KETUNTASAN",null,"KET"]
[]
[null,null,null,null,null,null,1,2,3,4,5,6,null,"YA","TIDAK"]
[{"$f":"+'DataBase-XI'!A62","v":46},{"$f":"IF(ISBLANK(A74),\"\",VLOOKUP(A74,Data1,2))","v":"X-2"},1,{"$f":"IF(ISBLANK(A74),\"\",VLOOKUP(A74,Data1,3))","v":"ADITYA YUDISTIRA"},{"$f":"IF(ISBLANK(A74),\"\",VLOOKUP(A74,Data1,5))","v":9980450357},{"$f":"IF(ISBLANK(A74),\"\",VLOOKUP(A74,Data1,6))","v":"L"}]
[{"$f":"+A74+1","v":47},"X-2",2,0,0,0]
[48,"X-2",3,0,0,0]
[49,"X-2",4,0,0,0]
[50,"X-2",5,0,0,0]
[51,"X-2",6,0,0,0]
[52,"X-2",7,0,0,0]
[53,"X-2",8,0,0,0]
[54,"X-2",9,0,0,0]
[55,"X-2",10,0,0,0]
[56,"X-2",11,0,0,0]
[57,"X-2",12,0,0,0]
[58,"X-2",13,0,0,0]
[59,"X-2",14,0,0,0]
[60,"X-2",15,0,0,0]
[61,"X-2",16,0,0,0]
[62,"X-2",17,0,0,0]
[63,"X-2",18,0,0,0]
[64,"X-2",19,0,0,0]
[65,"X-2",20,0,0,0]
[66,"X-2",21,0,0,0]
[67,"X-2",22,0,0,0]
[68,"X-2",23,0,0,0]
[69,"X-2",24,0,0,0]
[70,"X-2",25,0,0,0]
[71,"X-2",26,0,0,0]
[72,"X-2",27,0,0,0]
[73,"X-2",28,0,0,0]
[74,"X-2",29,0,0,0]
[75,"X-2",30,0,0,0]
[76,"X-2",31,0,0,0]
[77,"X-2",32,0,0,0]
[78,"X-2",33,0,0,0]
[79,"X-2",34,0,0,0]
[80,"X-2",35,0,0,0]
[81,"X-2",36,0,0,0]
[82,"X-2",37,0,0,0]
[83,"X-2",38,0,0,0]
[84,"X-2",39,0,0,0]
[85,"X-2",40,0,0,0]
[null,null,null,"Mengetahui",null,null,null,null,null,null,null,null,{"$f":"CONCATENATE(MENU!$D$13,\" ,   \",R114)","v":"Cilegon ,   24 Juli 2013"},null,null,null,null,{"$f":"TEXT(NOW(),\"dd mmmm yyyy\")","v":"24 Juli 2013"}]
[{"$f":"MAX(A74:A112)","v":84},null,null,"Waka Kurikulum",null,null,null,null,null,null,null,null,"Guru Bidang Study"]
[]
[]
[null,null,null,"................................",null,null,null,null,null,null,null,null,"................................"]
[null,null,null,"NIP: ",null,null,"Mengetahui",null,null,null,null,null,"NIP: "]
[null,null,null,null,null,null,"Kepala Sekolah"]
[]
[]
[null,null,null,null,null,null,{"$f":"+[1]MENU!$C$16","v":"Asep Mansur,S.Pd"}]
[null,null,null,null,null,null,{"$f":"+[1]MENU!$C$17","v":"NIP: 19620101 198512 1 004"}]
[]
[]
[]
[]
[null,null,"DAFTAR NILAI MURNI"]
[null,null,{"$f":"+$C$2","v":"SMA NEGERI 5 CILEGON"}]
[null,null,{"$f":"+$C$3","v":"TAHUN AJARAN 2013-2014"}]
[]
[null,null,"MATA PELAJARAN",null,";",null,null,null,null,null,null,null,"Kelas/Semester:",null,null,{"$f":"+B138","v":"X-3"}]
[null,null,"NAMA SEKOLAH",null,{"$f":"+$C$2","v":"SMA NEGERI 5 CILEGON"}]
[null,null,"NO","NAMA SISWA","NISN","L/P","NILAI HARIAN / TUGAS",null,null,null,null,null,"RATA-RATA","KETUNTASAN",null,"KET"]
[]
[null,null,null,null,null,null,1,2,3,4,5,6,null,"YA","TIDAK"]
[{"$f":"+'DataBase-XI'!A119","v":91},{"$f":"IF(ISBLANK(A138),\"\",VLOOKUP(A138,Data1,2))","v":"X-3"},1,{"$f":"IF(ISBLANK(A138),\"\",VLOOKUP(A138,Data1,3))","v":"ADE SRI JUA ASIH"},{"$f":"IF(ISBLANK(A138),\"\",VLOOKUP(A138,Data1,5))","v":9988413542},{"$f":"IF(ISBLANK(A138),\"\",VLOOKUP(A138,Data1,6))","v":"P"}]
[{"$f":"+A138+1","v":92},"X-3",2,0,0,0]
[93,"X-3",3,0,0,0]
[94,"X-3",4,0,0,0]
[95,"X-3",5,0,0,0]
[96,"X-3",6,0,0,0]
[97,"X-3",7,0,0,0]
[98,"X-3",8,0,0,0]
[99,"X-3",9,0,0,0]
[100,"X-3",10,0,0,0]
[101,"X-3",11,0,0,0]
[102,"X-3",12,0,0,0]
[103,"X-3",13,0,0,0]
[104,"X-3",14,0,0,0]
[105,"X-3",15,0,0,0]
[106,"X-3",16,0,0,0]
[107,"X-3",17,0,0,0]
[108,"X-3",18,0,0,0]
[109,"X-3",19,0,0,0]
[110,"X-3",20,0,0,0]
[111,"X-3",21,0,0,0]
[112,"X-3",22,0,0,0]
[113,"X-3",23,0,0,0]
[114,"X-3",24,0,0,0]
[115,"X-3",25,0,0,0]
[116,"X-3",26,0,0,0]
[117,"X-3",27,0,0,0]
[118,"X-3",28,0,0,0]
[119,"X-3",29,0,0,0]
[120,"X-3",30,0,0,0]
[121,"X-3",31,0,0,0]
[122,"X-3",32,0,0,0]
[123,"X-3",33,0,0,0]
[124,"X-3",34,0,0,0]
[125,"X-3",35,0,0,0]
[126,"X-3",36,0,0,0]
[127,"X-3",37,0,0,0]
[128,"X-3",38,0,0,0]
[129,"X-3",39,0,0,0]
[130,"X-3",40,0,0,0]
[null,null,null,"Mengetahui",null,null,null,null,null,null,null,null,{"$f":"CONCATENATE(MENU!$D$13,\" ,   \",R178)","v":"Cilegon ,   24 Juli 2013"},null,null,null,null,{"$f":"TEXT(NOW(),\"dd mmmm yyyy\")","v":"24 Juli 2013"}]
[{"$f":"MAX(A138:A176)","v":129},null,null,"Waka Kurikulum",null,null,null,null,null,null,null,null,"Guru Bidang Study"]
[]
[]
[null,null,null,"................................",null,null,null,null,null,null,null,null,"................................"]
[null,null,null,"NIP: ",null,null,"Mengetahui",null,null,null,null,null,"NIP: "]
[null,null,null,null,null,null,"Kepala Sekolah"]
[]
[]
[null,null,null,null,null,null,{"$f":"+[1]MENU!$C$16","v":"Asep Mansur,S.Pd"}]
[null,null,null,null,null,null,{"$f":"+[1]MENU!$C$17","v":"NIP: 19620101 198512 1 004"}]
[]
[]
[]
[]
[null,null,"DAFTAR NILAI MURNI"]
[null,null,{"$f":"+$C$2","v":"SMA NEGERI 5 CILEGON"}]
[null,null,{"$f":"+$C$3","v":"TAHUN AJARAN 2013-2014"}]
[]
[null,null,"MATA PELAJARAN",null,";",null,null,null,null,null,null,null,"Kelas/Semester:",null,null,{"$f":"+B202","v":"X-4"}]
[null,null,"NAMA SEKOLAH",null,{"$f":"+$C$2","v":"SMA NEGERI 5 CILEGON"}]
[null,null,"NO","NAMA SISWA","NISN","L/P","NILAI HARIAN / TUGAS",null,null,null,null,null,"RATA-RATA","KETUNTASAN",null,"KET"]
[]
[null,null,null,null,null,null,1,2,3,4,5,6,null,"YA","TIDAK"]
[{"$f":"+'DataBase-XI'!A176","v":136},{"$f":"IF(ISBLANK(A202),\"\",VLOOKUP(A202,Data1,2))","v":"X-4"},1,{"$f":"IF(ISBLANK(A202),\"\",VLOOKUP(A202,Data1,3))","v":"ADE ISWANDI"},{"$f":"IF(ISBLANK(A202),\"\",VLOOKUP(A202,Data1,5))","v":"9980450221"},{"$f":"IF(ISBLANK(A202),\"\",VLOOKUP(A202,Data1,6))","v":"L"}]
[{"$f":"+A202+1","v":137},"X-4",2,0,0,0]
[138,"X-4",3,0,0,0]
[139,"X-4",4,0,0,0]
[140,"X-4",5,0,0,0]
[141,"X-4",6,0,0,0]
[142,"X-4",7,0,0,0]
[143,"X-4",8,0,0,0]
[144,"X-4",9,0,0,0]
[145,"X-4",10,0,0,0]
[146,"X-4",11,0,0,0]
[147,"X-4",12,0,0,0]
[148,"X-4",13,0,0,0]
[149,"X-4",14,0,0,0]
[150,"X-4",15,0,0,0]
[151,"X-4",16,0,0,0]
[152,"X-4",17,0,0,0]
[153,"X-4",18,0,0,0]
[154,"X-4",19,0,0,0]
[155,"X-4",20,0,0,0]
[156,"X-4",21,0,0,0]
[157,"X-4",22,0,0,0]
[158,"X-4",23,0,0,0]
[159,"X-4",24,0,0,0]
[160,"X-4",25,0,0,0]
[161,"X-4",26,0,0,0]
[162,"X-4",27,0,0,0]
[163,"X-4",28,0,0,0]
[164,"X-4",29,0,0,0]
[165,"X-4",30,0,0,0]
[166,"X-4",31,0,0,0]
[167,"X-4",32,0,0,0]
[168,"X-4",33,0,0,0]
[169,"X-4",34,0,0,0]
[170,"X-4",35,0,0,0]
[171,"X-4",36,0,0,0]
[172,"X-4",37,0,0,0]
[173,"X-4",38,0,0,0]
[174,"X-4",39,0,0,0]
[175,"X-4",40,0,0,0]
[null,null,null,"Mengetahui",null,null,null,null,null,null,null,null,{"$f":"CONCATENATE(MENU!$D$13,\" ,   \",R242)","v":"Cilegon ,   24 Juli 2013"},null,null,null,null,{"$f":"TEXT(NOW(),\"dd mmmm yyyy\")","v":"24 Juli 2013"}]
[{"$f":"MAX(A202:A240)","v":174},null,null,"Waka Kurikulum",null,null,null,null,null,null,null,null,"Guru Bidang Study"]
[]
[]
[null,null,null,"................................",null,null,null,null,null,null,null,null,"................................"]
[null,null,null,"NIP: ",null,null,"Mengetahui",null,null,null,null,null,"NIP: "]
[null,null,null,null,null,null,"Kepala Sekolah"]
[]
[]
[null,null,null,null,null,null,{"$f":"+[1]MENU!$C$16","v":"Asep Mansur,S.Pd"}]
[null,null,null,null,null,null,{"$f":"+[1]MENU!$C$17","v":"NIP: 19620101 198512 1 004"}]
[]
[]
[]
[]
[null,null,"DAFTAR NILAI MURNI"]
[null,null,{"$f":"+$C$2","v":"SMA NEGERI 5 CILEGON"}]
[null,null,{"$f":"+$C$3","v":"TAHUN AJARAN 2013-2014"}]
[]
[null,null,"MATA PELAJARAN",null,";",null,null,null,null,null,null,null,"Kelas/Semester:",null,null,{"$f":"+B266","v":"X-5"}]
[null,null,"NAMA SEKOLAH",null,{"$f":"+$C$2","v":"SMA NEGERI 5 CILEGON"}]
[null,null,"NO","NAMA SISWA","NISN","L/P","NILAI HARIAN / TUGAS",null,null,null,null,null,"RATA-RATA","KETUNTASAN",null,"KET"]
[]
[null,null,null,null,null,null,1,2,3,4,5,6,null,"YA","TIDAK"]
[{"$f":"+'DataBase-XI'!A233","v":181},{"$f":"IF(ISBLANK(A266),\"\",VLOOKUP(A266,Data1,2))","v":"X-5"},1,{"$f":"IF(ISBLANK(A266),\"\",VLOOKUP(A266,Data1,3))","v":"ABDUS SALAM"},{"$f":"IF(ISBLANK(A266),\"\",VLOOKUP(A266,Data1,5))","v":"9985058275"},{"$f":"IF(ISBLANK(A266),\"\",VLOOKUP(A266,Data1,6))","v":"L"}]
[{"$f":"+A266+1","v":182},"X-5",2,0,0,0]
[183,"X-5",3,0,0,0]
[184,"X-5",4,0,0,0]
[185,"X-5",5,0,0,0]
[186,"X-5",6,0,0,0]
[187,"X-5",7,0,0,0]
[188,"X-5",8,0,0,0]
[189,"X-5",9,0,0,0]
[190,"X-5",10,0,0,0]
[191,"X-5",11,0,0,0]
[192,"X-5",12,0,0,0]
[193,"X-5",13,0,0,0]
[194,"X-5",14,0,0,0]
[195,"X-5",15,0,0,0]
[196,"X-5",16,0,0,0]
[197,"X-5",17,0,0,0]
[198,"X-5",18,0,0,0]
[199,"X-5",19,0,0,0]
[200,"X-5",20,0,0,0]
[201,"X-5",21,0,0,0]
[202,"X-5",22,0,0,0]
[203,"X-5",23,0,0,0]
[204,"X-5",24,0,0,0]
[205,"X-5",25,0,0,0]
[206,"X-5",26,0,0,0]
[207,"X-5",27,0,0,0]
[208,"X-5",28,0,0,0]
[209,"X-5",29,0,0,0]
[210,"X-5",30,0,0,0]
[211,"X-5",31,0,0,0]
[212,"X-5",32,0,0,0]
[213,"X-5",33,0,0,0]
[214,"X-5",34,0,0,0]
[215,"X-5",35,0,0,0]
[216,"X-5",36,0,0,0]
[217,"X-5",37,0,0,0]
[218,"X-5",38,0,0,0]
[219,"X-5",39,0,0,0]
[220,"X-5",40,0,0,0]
[null,null,null,"Mengetahui",null,null,null,null,null,null,null,null,{"$f":"CONCATENATE(MENU!$D$13,\" ,   \",R306)","v":"Cilegon ,   24 Juli 2013"},null,null,null,null,{"$f":"TEXT(NOW(),\"dd mmmm yyyy\")","v":"24 Juli 2013"}]
[{"$f":"MAX(A266:A305)","v":220},null,null,"Waka Kurikulum",null,null,null,null,null,null,null,null,"Guru Bidang Study"]
[]
[]
[null,null,null,"................................",null,null,null,null,null,null,null,null,"................................"]
[null,null,null,"NIP: ",null,null,"Mengetahui",null,null,null,null,null,"NIP: "]
[null,null,null,null,null,null,"Kepala Sekolah"]
[]
[]
[null,null,null,null,null,null,{"$f":"+[1]MENU!$C$16","v":"Asep Mansur,S.Pd"}]
[null,null,null,null,null,null,{"$f":"+[1]MENU!$C$17","v":"NIP: 19620101 198512 1 004"}]
[]
[]
[]
[]
[null,null,"DAFTAR NILAI MURNI"]
[null,null,{"$f":"+$C$2","v":"SMA NEGERI 5 CILEGON"}]
[null,null,{"$f":"+$C$3","v":"TAHUN AJARAN 2013-2014"}]
[]
[null,null,"MATA PELAJARAN",null,";",null,null,null,null,null,null,null,"Kelas/Semester:",null,null,{"$f":"+B330","v":"X-6"}]
[null,null,"NAMA SEKOLAH",null,{"$f":"+$C$2","v":"SMA NEGERI 5 CILEGON"}]
[null,null,"NO","NAMA SISWA","NISN","L/P","NILAI HARIAN / TUGAS",null,null,null,null,null,"RATA-RATA","KETUNTASAN",null,"KET"]
[]
[null,null,null,null,null,null,1,2,3,4,5,6,null,"YA","TIDAK"]
[{"$f":"+'DataBase-XI'!A290","v":226},{"$f":"IF(ISBLANK(A330),\"\",VLOOKUP(A330,Data1,2))","v":"X-6"},1,{"$f":"IF(ISBLANK(A330),\"\",VLOOKUP(A330,Data1,3))","v":"ABDUL GOFUR"},{"$f":"IF(ISBLANK(A330),\"\",VLOOKUP(A330,Data1,5))","v":"9980452259"},{"$f":"IF(ISBLANK(A330),\"\",VLOOKUP(A330,Data1,6))","v":"L"}]
[{"$f":"+A330+1","v":227},"X-6",2,0,0,0]
[228,"X-6",3,0,0,0]
[229,"X-6",4,0,0,0]
[230,"X-6",5,0,0,0]
[231,"X-6",6,0,0,0]
[232,"X-6",7,0,0,0]
[233,"X-6",8,0,0,0]
[234,"X-6",9,0,0,0]
[235,"X-6",10,0,0,0]
[236,"X-6",11,0,0,0]
[237,"X-6",12,0,0,0]
[238,"X-6",13,0,0,0]
[239,"X-6",14,0,0,0]
[240,"X-6",15,0,0,0]
[241,"X-6",16,0,0,0]
[242,"X-6",17,0,0,0]
[243,"X-6",18,0,0,0]
[244,"X-6",19,0,0,0]
[245,"X-6",20,0,0,0]
[246,"X-6",21,0,0,0]
[247,"X-6",22,0,0,0]
[248,"X-6",23,0,0,0]
[249,"X-6",24,0,0,0]
[250,"X-6",25,0,0,0]
[251,"X-6",26,0,0,0]
[252,"X-6",27,0,0,0]
[253,"X-6",28,0,0,0]
[254,"X-6",29,0,0,0]
[255,"X-6",30,0,0,0]
[256,"X-6",31,0,0,0]
[257,"X-6",32,0,0,0]
[258,"X-6",33,0,0,0]
[259,"X-6",34,0,0,0]
[260,"X-6",35,0,0,0]
[261,"X-6",36,0,0,0]
[262,"X-6",37,0,0,0]
[263,"X-6",38,0,0,0]
[264,"X-6",39,0,0,0]
[265,"X-6",40,0,0,0]
[null,null,null,"Mengetahui",null,null,null,null,null,null,null,null,{"$f":"CONCATENATE(MENU!$D$13,\" ,   \",R370)","v":"Cilegon ,   24 Juli 2013"},null,null,null,null,{"$f":"TEXT(NOW(),\"dd mmmm yyyy\")","v":"24 Juli 2013"}]
[null,null,null,"Waka Kurikulum",null,null,null,null,null,null,null,null,"Guru Bidang Study"]
[]
[]
[null,null,null,"................................",null,null,null,null,null,null,null,null,"................................"]
[null,null,null,"NIP: ",null,null,"Mengetahui",null,null,null,null,null,"NIP: "]
[null,null,null,null,null,null,"Kepala Sekolah"]
[]
[]
[null,null,null,null,null,null,{"$f":"+[1]MENU!$C$16","v":"Asep Mansur,S.Pd"}]
[null,null,null,null,null,null,{"$f":"+[1]MENU!$C$17","v":"NIP: 19620101 198512 1 004"}]

{"sheet":"Absen-XI","index":9,"n_rows":388,"n_cols":22,"rows_kept":388,"cut":false,"hidden":false,"merged":[[0,0,5,0],[0,2,0,31],[1,2,1,31],[2,2,2,31],[4,2,5,2],[4,3,5,3],[4,4,5,4],[4,5,5,5],[4,6,4,31],[6,2,6,31],[56,20,56,30],[57,20,57,30],[68,2,68,31],[69,2,69,31],[70,2,70,31],[72,2,73,2],[72,3,73,3],[72,4,73,4],[72,5,73,5],[72,6,72,31],[74,2,74,31],[122,20,122,30],[123,20,123,30],[131,2,131,31],[132,2,132,31],[133,2,133,31],[135,2,136,2],[135,3,136,3],[135,4,136,4],[135,5,136,5],[135,6,135,31],[137,2,137,31],[186,20,186,30],[187,20,187,30],[198,2,198,31],[199,2,199,31],[200,2,200,31],[202,2,203,2],[202,3,203,3],[202,4,203,4],[202,5,203,5],[202,6,202,31],[204,2,204,31],[252,21,252,31],[253,21,253,31],[265,2,265,31],[266,2,266,31],[267,2,267,31],[269,2,270,2],[269,3,270,3],[269,4,270,4],[269,5,270,5],[269,6,269,31],[271,2,271,31],[319,20,319,30],[320,20,320,30],[332,2,332,31],[333,2,333,31],[334,2,334,31],[386,20,386,30],[387,20,387,30],[336,2,337,2],[336,3,337,3],[336,4,337,4],[336,5,337,5],[336,6,336,31],[338,2,338,31]]}
["NO URUT DATABASE",null,"DAFTAR HADIR SISWA"]
[null,null,{"$f":"+MENU!$D$8","v":"SMA NEGERI 5 CILEGON"}]
[null,null,{"$f":"CONCATENATE(MENU!$C$7,\" \",MENU!$D$7)","v":"TAHUN AJARAN 2013-2014"}]
[null,null,"KELAS",null,{"$f":"IF(ISBLANK(A8),\"\",VLOOKUP(A8,Data2,2))","v":"XI IPA-1"}]
[null,null,"NO","NIS","NAMA","L/P","Tanggal"]
[]
[]
[{"$f":"+'DataBase-XI'!A5","v":1},{"$f":"IF(ISBLANK(A8),\"\",VLOOKUP(A8,Data2,2))","v":"XI IPA-1"},1,{"$f":"IF(ISBLANK(A8),\"\",VLOOKUP(A8,Data2,5))","v":9907455968},{"$f":"IF(ISBLANK(A8),\"\",VLOOKUP(A8,Data2,3))","v":"AL HEELAL IDHANA"},{"$f":"IF(ISBLANK(A8),\"\",VLOOKUP(A8,Data2,6))","v":"L"}]
[2,"XI IPA-1",2,0,0,0]
[3,"XI IPA-1",3,0,0,0]
[4,"XI IPA-1",4,0,0,0]
[5,"XI IPA-1",5,0,0,0]
[6,"XI IPA-1",6,0,0,0]
[7,"XI IPA-1",7,0,0,0]
[8,"XI IPA-1",8,0,0,0]
[9,"XI IPA-1",9,0,0,0]
[10,"XI IPA-1",10,0,0,0]
[11,"XI IPA-1",11,0,0,0]
[12,"XI IPA-1",12,0,0,0]
[13,"XI IPA-1",13,0,0,0]
[14,"XI IPA-1",14,0,0,0]
[15,"XI IPA-1",15,0,0,0]
[16,"XI IPA-1",16,0,0,0]
[17,"XI IPA-1",17,0,0,0]
[18,"XI IPA-1",18,0,0,0]
[19,"XI IPA-1",19,0,0,0]
[20,"XI IPA-1",20,0,0,0]
[21,"XI IPA-1",21,0,0,0]
[22,"XI IPA-1",22,0,0,0]
[23,"XI IPA-1",23,0,0,0]
[24,"XI IPA-1",24,0,0,0]
[25,"XI IPA-1",25,0,0,0]
[26,"XI IPA-1",26,0,0,0]
[27,"XI IPA-1",27,0,0,0]
[28,"XI IPA-1",28,0,0,0]
[29,"XI IPA-1",29,0,0,0]
[30,"XI IPA-1",30,0,0,0]
[31,"XI IPA-1",31,0,0,0]
[32,"XI IPA-1",32,0,0,0]
[33,"XI IPA-1",33,0,0,0]
[34,"XI IPA-1",34,0,0,0]
[35,"XI IPA-1",35,0,0,0]
[36,"XI IPA-1",36,0,0,0]
[37,"XI IPA-1",37,0,0,0]
[38,"XI IPA-1",38,0,0,0]
[39,"XI IPA-1",39,0,0,0]
[40,"XI IPA-1",40]
[]
[{"$f":"MAX(A8:A47)","v":40},null,null,null,"Jumlah Laki-laki",{"$f":"COUNTIF(F8:F47,\"L\")","v":1},null,null,null,null,null,null,null,null,null,null,null,null,null,null,"Cilegon,…………………………….20"]
[null,null,null,null,"Jumlah Perempuan",{"$f":"COUNTIF(F8:F47,\"P\")","v":0},null,null,null,null,null,null,null,null,null,null,null,null,null,null,"Guru Bidang Studi"]
[null,null,null,null,"Jumlah Total",{"$f":"SUM(F49:F50)","v":1}]
[]
[]
[]
[]
[]
[null,null,null,null,null,null,null,null,null,null,null,null,null,null,null,null,null,null,null,null,"(……………………...……….)"]
[null,null,null,null,null,null,null,null,null,null,null,null,null,null,null,null,null,null,null,null,"NIP:……………………………………."]
[]
[]
[]
[]
[]
[]
[]
[]
[]
[]
[null,null,"DAFTAR HADIR SISWA"]
[null,null,{"$f":"+MENU!$D$8","v":"SMA NEGERI 5 CILEGON"}]
[null,null,{"$f":"CONCATENATE(MENU!$C$7,\" \",MENU!$D$7)","v":"TAHUN AJARAN 2013-2014"}]
[null,null,"KELAS",null,{"$f":"IF(ISBLANK(A76),\"\",VLOOKUP(A76,Data2,2))","v":"XI IPA-2"}]
[null,null,"NO","NIS","NAMA","L/P","Tanggal"]
[]
[]
[{"$f":"+'DataBase-XI'!A62","v":46},{"$f":"IF(ISBLANK(A76),\"\",VLOOKUP(A76,Data2,2))","v":"XI IPA-2"},1,{"$f":"IF(ISBLANK(A76),\"\",VLOOKUP(A76,Data2,5))","v":"9966354541"},{"$f":"IF(ISBLANK(A76),\"\",VLOOKUP(A76,Data2,3))","v":"AFID HIDAYAT"},{"$f":"IF(ISBLANK(A76),\"\",VLOOKUP(A76,Data2,6))","v":"L"}]
[{"$f":"+A76+1","v":47},"XI IPA-2",2,0,0,0]
[48,"XI IPA-2",3,0,0,0]
[49,"XI IPA-2",4,0,0,0]
[50,"XI IPA-2",5,0,0,0]
[51,"XI IPA-2",6,0,0,0]
[52,"XI IPA-2",7,0,0,0]
[53,"XI IPA-2",8,0,0,0]
[54,"XI IPA-2",9,0,0,0]
[55,"XI IPA-2",10,0,0,0]
[56,"XI IPA-2",11,0,0,0]
[57,"XI IPA-2",12,0,0,0]
[58,"XI IPA-2",13,0,0,0]
[59,"XI IPA-2",14,0,0,0]
[60,"XI IPA-2",15,0,0,0]
[61,"XI IPA-2",16,0,0,0]
[62,"XI IPA-2",17,0,0,0]
[63,"XI IPA-2",18,0,0,0]
[64,"XI IPA-2",19,0,0,0]
[65,"XI IPA-2",20,0,0,0]
[66,"XI IPA-2",21,0,0,0]
[67,"XI IPA-2",22,0,0,0]
[68,"XI IPA-2",23,0,0,0]
[69,"XI IPA-2",24,0,0,0]
[70,"XI IPA-2",25,0,0,0]
[71,"XI IPA-2",26,0,0,0]
[72,"XI IPA-2",27,0,0,0]
[73,"XI IPA-2",28,0,0,0]
[74,"XI IPA-2",29,0,0,0]
[75,"XI IPA-2",30,0,0,0]
[76,"XI IPA-2",31,0,0,0]
[77,"XI IPA-2",32,0,0,0]
[78,"XI IPA-2",33,0,0,0]
[79,"XI IPA-2",34,0,0,0]
[80,"XI IPA-2",35,0,0,0]
[81,"XI IPA-2",36,0,0,0]
[82,"XI IPA-2",37,0,0,0]
[83,"XI IPA-2",38,0,0,0]
[84,"XI IPA-2",39,0,0,0]
[85,"XI IPA-2",40,0,0,0]
[]
[{"$f":"MAX(A76:A113)","v":83},null,null,null,"Jumlah Laki-laki",{"$f":"COUNTIF(F76:F115,\"L\")","v":1},null,null,null,null,null,null,null,null,null,null,null,null,null,null,"Cilegon,…………………………….20"]
[null,null,null,null,"Jumlah Perempuan",{"$f":"COUNTIF(F76:F115,\"P\")","v":0},null,null,null,null,null,null,null,null,null,null,null,null,null,null,"Guru Bidang Studi"]
[null,null,null,null,"Jumlah Total",{"$f":"SUM(F117:F118)","v":1}]
[]
[]
[]
[null,null,null,null,null,null,null,null,null,null,null,null,null,null,null,null,null,null,null,null,"(……………………...……….)"]
[null,null,null,null,null,null,null,null,null,null,null,null,null,null,null,null,null,null,null,null,"NIP:……………………………………."]
[]
[]
[]
[]
[]
[]
[]
[null,null,"DAFTAR HADIR SISWA"]
[null,null,{"$f":"+MENU!$D$8","v":"SMA NEGERI 5 CILEGON"}]
[null,null,{"$f":"CONCATENATE(MENU!$C$7,\" \",MENU!$D$7)","v":"TAHUN AJARAN 2013-2014"}]
[null,null,"KELAS",null,{"$f":"IF(ISBLANK(A139),\"\",VLOOKUP(A139,Data2,2))","v":"XI IPA-3"}]
[null,null,"NO","NIS","NAMA","L/P","Tanggal"]
[]
[]
[{"$f":"+'DataBase-XI'!A119","v":91},{"$f":"IF(ISBLANK(A139),\"\",VLOOKUP(A139,Data2,2))","v":"XI IPA-3"},1,{"$f":"IF(ISBLANK(A139),\"\",VLOOKUP(A139,Data2,5))","v":"9966517605"},{"$f":"IF(ISBLANK(A139),\"\",VLOOKUP(A139,Data2,3))","v":"ADE HAIRUNISA MARDIAH"},{"$f":"IF(ISBLANK(A139),\"\",VLOOKUP(A139,Data2,6))","v":"P"}]
[{"$f":"+A139+1","v":92},"XI IPA-3",2,0,0,0]
[93,"XI IPA-3",3,0,0,0]
[94,"XI IPA-3",4,0,0,0]
[95,"XI IPA-3",5,0,0,0]
[96,"XI IPA-3",6,0,0,0]
[97,"XI IPA-3",7,0,0,0]
[98,"XI IPA-3",8,0,0,0]
[99,"XI IPA-3",9,0,0,0]
[100,"XI IPA-3",10,0,0,0]
[101,"XI IPA-3",11,0,0,0]
[102,"XI IPA-3",12,0,0,0]
[103,"XI IPA-3",13,0,0,0]
[104,"XI IPA-3",14,0,0,0]
[105,"XI IPA-3",15,0,0,0]
[106,"XI IPA-3",16,0,0,0]
[107,"XI IPA-3",17,0,0,0]
[108,"XI IPA-3",18,0,0,0]
[109,"XI IPA-3",19,0,0,0]
[110,"XI IPA-3",20,0,0,0]
[111,"XI IPA-3",21,0,0,0]
[112,"XI IPA-3",22,0,0,0]
[113,"XI IPA-3",23,0,0,0]
[114,"XI IPA-3",24,0,0,0]
[115,"XI IPA-3",25,0,0,0]
[116,"XI IPA-3",26,0,0,0]
[117,"XI IPA-3",27,0,0,0]
[118,"XI IPA-3",28,0,0,0]
[119,"XI IPA-3",29,0,0,0]
[120,"XI IPA-3",30,0,0,0]
[121,"XI IPA-3",31,0,0,0]
[122,"XI IPA-3",32,0,0,0]
[123,"XI IPA-3",33,0,0,0]
[124,"XI IPA-3",34,0,0,0]
[125,"XI IPA-3",35,0,0,0]
[{"$f":"+A173+1","v":126},"XI IPA-3",36,0,0,0]
[{"$f":"+A174+1","v":127},"XI IPA-3",37,0,0,0]
[{"$f":"+A175+1","v":128},"XI IPA-3",38,0,0,0]
[{"$f":"+A176+1","v":129},"XI IPA-3",39,0,0,0]
[{"$f":"+A177+1","v":130},"XI IPA-3",40,0,0,0]
[]
[{"$f":"MAX(A139:A177)","v":129},null,null,null,"Jumlah Laki-laki",{"$f":"COUNTIF(F139:F178,\"L\")","v":0},null,null,null,null,null,null,null,null,null,null,null,null,null,null,"Cilegon,…………………………….20"]
[null,null,null,null,"Jumlah Perempuan",{"$f":"COUNTIF(F139:F178,\"P\")","v":1},null,null,null,null,null,null,null,null,null,null,null,null,null,null,"Guru Bidang Studi"]
[null,null,null,null,"Jumlah Total",{"$f":"SUM(F180:F181)","v":1}]
[]
[]
[]
[]
[null,null,null,null,null,null,null,null,null,null,null,null,null,null,null,null,null,null,null,null,"(……………………...……….)"]
[null,null,null,null,null,null,null,null,null,null,null,null,null,null,null,null,null,null,null,null,"NIP:……………………………………."]
[]
[]
[]
[]
[]
[]
[]
[]
[]
[]
[null,null,"DAFTAR HADIR SISWA"]
[null,null,{"$f":"+MENU!$D$8","v":"SMA NEGERI 5 CILEGON"}]
[null,null,{"$f":"CONCATENATE(MENU!$C$7,\" \",MENU!$D$7)","v":"TAHUN AJARAN 2013-2014"}]
[null,null,"KELAS",null,{"$f":"IF(ISBLANK(A206),\"\",VLOOKUP(A206,Data2,2))","v":"XI IPS-1"}]
[null,null,"NO","NIS","NAMA","L/P","Tanggal"]
[]
[]
[{"$f":"+'DataBase-XI'!A176","v":136},{"$f":"IF(ISBLANK(A206),\"\",VLOOKUP(A206,Data2,2))","v":"XI IPS-1"},1,{"$f":"IF(ISBLANK(A206),\"\",VLOOKUP(A206,Data2,5))","v":"9970454991"},{"$f":"IF(ISBLANK(A206),\"\",VLOOKUP(A206,Data2,3))","v":"AAM TAMIMI"},{"$f":"IF(ISBLANK(A206),\"\",VLOOKUP(A206,Data2,6))","v":"L"}]
[{"$f":"+A206+1","v":137},"XI IPS-1",2,0,0,0]
[138,"XI IPS-1",3,0,0,0]
[139,"XI IPS-1",4,0,0,0]
[140,"XI IPS-1",5,0,0,0]
[141,"XI IPS-1",6,0,0,0]
[142,"XI IPS-1",7,0,0,0]
[143,"XI IPS-1",8,0,0,0]
[144,"XI IPS-1",9,0,0,0]
[145,"XI IPS-1",10,0,0,0]
[146,"XI IPS-1",11,0,0,0]
[147,"XI IPS-1",12,0,0,0]
[148,"XI IPS-1",13,0,0,0]
[149,"XI IPS-1",14,0,0,0]
[150,"XI IPS-1",15,0,0,0]
[151,"XI IPS-1",16,0,0,0]
[152,"XI IPS-1",17,0,0,0]
[153,"XI IPS-1",18,0,0,0]
[154,"XI IPS-1",19,0,0,0]
[155,"XI IPS-1",20,0,0,0]
[156,"XI IPS-1",21,0,0,0]
[157,"XI IPS-1",22,0,0,0]
[158,"XI IPS-1",23,0,0,0]
[159,"XI IPS-1",24,0,0,0]
[160,"XI IPS-1",25,0,0,0]
[161,"XI IPS-1",26,0,0,0]
[162,"XI IPS-1",27,0,0,0]
[163,"XI IPS-1",28,0,0,0]
[164,"XI IPS-1",29,0,0,0]
[165,"XI IPS-1",30,0,0,0]
[166,"XI IPS-1",31,0,0,0]
[167,"XI IPS-1",32,0,0,0]
[168,"XI IPS-1",33,0,0,0]
[169,"XI IPS-1",34,0,0,0]
[170,"XI IPS-1",35,0,0,0]
[{"$f":"+A240+1","v":171},"XI IPS-1",36,0,0,0]
[{"$f":"+A241+1","v":172},"XI IPS-1",37,0,0,0]
[{"$f":"+A242+1","v":173},"XI IPS-1",38,0,0,0]
[{"$f":"+A243+1","v":174},"XI IPS-1",39,0,0,0]
[{"$f":"+A244+1","v":175},"XI IPS-1",40,0,0,0]
[]
[{"$f":"MAX(A206:A244)","v":174},null,null,null,"Jumlah Laki-laki",{"$f":"COUNTIF(F206:F245,\"L\")","v":1},null,null,null,null,null,null,null,null,null,null,null,null,null,null,null,"Cilegon,…………………………….20"]
[null,null,null,null,"Jumlah Perempuan",{"$f":"COUNTIF(F206:F245,\"P\")","v":0},null,null,null,null,null,null,null,null,null,null,null,null,null,null,null,"Guru Bidang Studi"]
[null,null,null,null,"Jumlah Total",{"$f":"SUM(F247:F248)","v":1}]
[]
[]
[]
[null,null,null,null,null,null,null,null,null,null,null,null,null,null,null,null,null,null,null,null,null,"(……………………...……….)"]
[null,null,null,null,null,null,null,null,null,null,null,null,null,null,null,null,null,null,null,null,null,"NIP:……………………………………."]
[]
[]
[]
[]
[]
[]
[]
[]
[]
[]
[]
[null,null,"DAFTAR HADIR SISWA"]
[null,null,{"$f":"+MENU!$D$8","v":"SMA NEGERI 5 CILEGON"}]
[null,null,{"$f":"CONCATENATE(MENU!$C$7,\" \",MENU!$D$7)","v":"TAHUN AJARAN 2013-2014"}]
[null,null,"KELAS",null,{"$f":"IF(ISBLANK(A273),\"\",VLOOKUP(A273,Data2,2))","v":"XI IPS-2"}]
[null,null,"NO","NIS","NAMA","L/P","Tanggal"]
[]
[]
[{"$f":"+'DataBase-XI'!A233","v":181},{"$f":"IF(ISBLANK(A273),\"\",VLOOKUP(A273,Data2,2))","v":"XI IPS-2"},1,{"$f":"IF(ISBLANK(A273),\"\",VLOOKUP(A273,Data2,5))","v":"9970454708"},{"$f":"IF(ISBLANK(A273),\"\",VLOOKUP(A273,Data2,3))","v":"AGUS RAHAYU"},{"$f":"IF(ISBLANK(A273),\"\",VLOOKUP(A273,Data2,6))","v":"P"}]
[{"$f":"+A273+1","v":182},"XI IPS-2",2,0,0,0]
[183,"XI IPS-2",3,0,0,0]
[184,"XI IPS-2",4,0,0,0]
[185,"XI IPS-2",5,0,0,0]
[186,"XI IPS-2",6,0,0,0]
[187,"XI IPS-2",7,0,0,0]
[188,"XI IPS-2",8,0,0,0]
[189,"XI IPS-2",9,0,0,0]
[190,"XI IPS-2",10,0,0,0]
[191,"XI IPS-2",11,0,0,0]
[192,"XI IPS-2",12,0,0,0]
[193,"XI IPS-2",13,0,0,0]
[194,"XI IPS-2",14,0,0,0]
[195,"XI IPS-2",15,0,0,0]
[196,"XI IPS-2",16,0,0,0]
[197,"XI IPS-2",17,0,0,0]
[198,"XI IPS-2",18,0,0,0]
[199,"XI IPS-2",19,0,0,0]
[200,"XI IPS-2",20,0,0,0]
[201,"XI IPS-2",21,0,0,0]
[202,"XI IPS-2",22,0,0,0]
[203,"XI IPS-2",23,0,0,0]
[204,"XI IPS-2",24,0,0,0]
[205,"XI IPS-2",25,0,0,0]
[206,"XI IPS-2",26,0,0,0]
[207,"XI IPS-2",27,0,0,0]
[208,"XI IPS-2",28,0,0,0]
[209,"XI IPS-2",29,0,0,0]
[210,"XI IPS-2",30,0,0,0]
[211,"XI IPS-2",31,0,0,0]
[212,"XI IPS-2",32,0,0,0]
[213,"XI IPS-2",33,0,0,0]
[214,"XI IPS-2",34,0,0,0]
[215,"XI IPS-2",35,0,0,0]
[{"$f":"+A307+1","v":216},"XI IPS-2",36,0,0,0]
[{"$f":"+A308+1","v":217},"XI IPS-2",37,0,0,0]
[{"$f":"+A309+1","v":218},"XI IPS-2",38,0,0,0]
[{"$f":"+A310+1","v":219},"XI IPS-2",39,0,0,0]
[{"$f":"+A311+1","v":220},"XI IPS-2",40,0,0,0]
[]
[{"$f":"MAX(A273:A312)","v":220},null,null,null,"Jumlah Laki-laki",{"$f":"COUNTIF(F272:F312,\"L\")","v":0},null,null,null,null,null,null,null,null,null,null,null,null,null,null,"Cilegon,…………………………….20"]
[null,null,null,null,"Jumlah Perempuan",{"$f":"COUNTIF(F272:F312,\"P\")","v":1},null,null,null,null,null,null,null,null,null,null,null,null,null,null,"Guru Bidang Studi"]
[null,null,null,null,"Jumlah Total",{"$f":"SUM(F314:F315)","v":1}]
[]
[]
[]
[null,null,null,null,null,null,null,null,null,null,null,null,null,null,null,null,null,null,null,null,"(……………………...……….)"]
[null,null,null,null,null,null,null,null,null,null,null,null,null,null,null,null,null,null,null,null,"NIP:……………………………………."]
[]
[]
[]
[]
[]
[]
[]
[]
[]
[]
[]
[null,null,"DAFTAR HADIR SISWA"]
[null,null,{"$f":"+MENU!$D$8","v":"SMA NEGERI 5 CILEGON"}]
[null,null,{"$f":"CONCATENATE(MENU!$C$7,\" \",MENU!$D$7)","v":"TAHUN AJARAN 2013-2014"}]
[null,null,"KELAS",null,{"$f":"IF(ISBLANK(A340),\"\",VLOOKUP(A340,Data2,2))","v":"XI IPS-3"}]
[null,null,"NO","NIS","NAMA","L/P","Tanggal"]
[]
[]
[{"$f":"+'DataBase-XI'!A290","v":226},{"$f":"IF(ISBLANK(A340),\"\",VLOOKUP(A340,Data2,2))","v":"XI IPS-3"},1,{"$f":"IF(ISBLANK(A340),\"\",VLOOKUP(A340,Data2,5))","v":"9965299861"},{"$f":"IF(ISBLANK(A340),\"\",VLOOKUP(A340,Data2,3))","v":"ABDUL WAHID"},{"$f":"IF(ISBLANK(A340),\"\",VLOOKUP(A340,Data2,6))","v":"L"}]
[{"$f":"+A340+1","v":227},"XI IPS-3",2,0,0,0]
[228,"XI IPS-3",3,0,0,0]
[229,"XI IPS-3",4,0,0,0]
[230,"XI IPS-3",5,0,0,0]
[231,"XI IPS-3",6,0,0,0]
[232,"XI IPS-3",7,0,0,0]
[233,"XI IPS-3",8,0,0,0]
[234,"XI IPS-3",9,0,0,0]
[235,"XI IPS-3",10,0,0,0]
[236,"XI IPS-3",11,0,0,0]
[237,"XI IPS-3",12,0,0,0]
[238,"XI IPS-3",13,0,0,0]
[239,"XI IPS-3",14,0,0,0]
[240,"XI IPS-3",15,0,0,0]
[241,"XI IPS-3",16,0,0,0]
[242,"XI IPS-3",17,0,0,0]
[243,"XI IPS-3",18,0,0,0]
[244,"XI IPS-3",19,0,0,0]
[245,"XI IPS-3",20,0,0,0]
[246,"XI IPS-3",21,0,0,0]
[247,"XI IPS-3",22,0,0,0]
[248,"XI IPS-3",23,0,0,0]
[249,"XI IPS-3",24,0,0,0]
[250,"XI IPS-3",25,0,0,0]
[251,"XI IPS-3",26,0,0,0]
[252,"XI IPS-3",27,0,0,0]
[253,"XI IPS-3",28,0,0,0]
[254,"XI IPS-3",29,0,0,0]
[255,"XI IPS-3",30,0,0,0]
[256,"XI IPS-3",31,0,0,0]
[257,"XI IPS-3",32,0,0,0]
[258,"XI IPS-3",33,0,0,0]
[259,"XI IPS-3",34,0,0,0]
[260,"XI IPS-3",35,0,0,0]
[{"$f":"+A374+1","v":261},"XI IPS-3",36,0,0,0]
[{"$f":"+A375+1","v":262},"XI IPS-3",37,0,0,0]
[{"$f":"+A376+1","v":263},"XI IPS-3",38,0,0,0]
[{"$f":"+A377+1","v":264},"XI IPS-3",39,0,0,0]
[{"$f":"+A378+1","v":265},"XI IPS-3",40,0,0,0]
[]
[null,null,null,null,"Jumlah Laki-laki",{"$f":"COUNTIF(F339:F379,\"L\")","v":1},null,null,null,null,null,null,null,null,null,null,null,null,null,null,"Cilegon,…………………………….20"]
[null,null,null,null,"Jumlah Perempuan",{"$f":"COUNTIF(F339:F379,\"P\")","v":0},null,null,null,null,null,null,null,null,null,null,null,null,null,null,"Guru Bidang Studi"]
[null,null,null,null,"Jumlah Total",{"$f":"SUM(F381:F382)","v":1}]
[]
[]
[]
[null,null,null,null,null,null,null,null,null,null,null,null,null,null,null,null,null,null,null,null,"(……………………...……….)"]
[null,null,null,null,null,null,null,null,null,null,null,null,null,null,null,null,null,null,null,null,"NIP:……………………………………."]

{"sheet":"Raport-XI","index":10,"n_rows":349,"n_cols":10,"rows_kept":349,"cut":false,"hidden":false,"merged":[[6,2,6,9],[60,2,60,9],[61,2,61,9],[62,2,62,9],[244,2,244,9],[182,2,183,2],[182,3,183,3],[182,4,183,4],[182,5,183,5],[184,2,184,9],[182,6,182,8],[182,9,183,9],[124,2,124,9],[178,2,178,9],[179,2,179,9],[180,2,180,9],[298,2,298,9],[299,2,299,9],[300,2,300,9],[238,2,238,9],[239,2,239,9],[240,2,240,9],[242,2,243,2],[242,3,243,3],[242,4,243,4],[242,5,243,5],[242,6,242,8],[242,9,243,9],[302,2,303,2],[302,3,303,3],[302,4,303,4],[302,5,303,5],[304,2,304,9],[302,6,302,8],[302,9,303,9],[118,2,118,9],[119,2,119,9],[120,2,120,9],[122,2,123,2],[122,3,123,3],[122,4,123,4],[122,5,123,5],[122,6,122,8],[122,9,123,9],[64,2,65,2],[64,3,65,3],[64,4,65,4],[64,5,65,5],[66,2,66,9],[64,6,64,8],[64,9,65,9],[0,0,5,0],[0,2,0,9],[1,2,1,9],[2,2,2,9],[4,2,5,2],[4,3,5,3],[4,4,5,4],[4,5,5,5],[4,6,4,8],[4,9,5,9]]}
["NO URUT DATABASE",null,"DAFTAR NILAI SISWA"]
[null,null,{"$f":"+MENU!$D$8","v":"SMA NEGERI 5 CILEGON"}]
[null,null,{"$f":"CONCATENATE(MENU!$C$7,\" \",MENU!$D$7)","v":"TAHUN AJARAN 2013-2014"}]
[null,null,"KELAS",null,{"$f":"IF(ISBLANK(A8),\"\",VLOOKUP(A8,Data2,2))","v":"XI IPA-1"}]
[null,null,"NO","NIS","NAMA","L/P","NILAI RAPORT",null,null,"KET"]
[null,null,null,null,null,null,"Kognitif","Afektif","Psikomotor"]
[]
[{"$f":"+'DataBase-XI'!A5","v":1},{"$f":"IF(ISBLANK(A8),\"\",VLOOKUP(A8,Data2,2))","v":"XI IPA-1"},1,{"$f":"IF(ISBLANK(A8),\"\",VLOOKUP(A8,Data2,5))","v":9907455968},{"$f":"IF(ISBLANK(A8),\"\",VLOOKUP(A8,Data2,3))","v":"AL HEELAL IDHANA"},{"$f":"IF(ISBLANK(A8),\"\",VLOOKUP(A8,Data2,6))","v":"L"}]
[2,"XI IPA-1",2,0,0,0]
[3,"XI IPA-1",3,0,0,0]
[4,"XI IPA-1",4,0,0,0]
[5,"XI IPA-1",5,0,0,0]
[6,"XI IPA-1",6,0,0,0]
[7,"XI IPA-1",7,0,0,0]
[8,"XI IPA-1",8,0,0,0]
[9,"XI IPA-1",9,0,0,0]
[10,"XI IPA-1",10,0,0,0]
[11,"XI IPA-1",11,0,0,0]
[12,"XI IPA-1",12,0,0,0]
[13,"XI IPA-1",13,0,0,0]
[14,"XI IPA-1",14,0,0,0]
[15,"XI IPA-1",15,0,0,0]
[16,"XI IPA-1",16,0,0,0]
[17,"XI IPA-1",17,0,0,0]
[18,"XI IPA-1",18,0,0,0]
[19,"XI IPA-1",19,0,0,0]
[20,"XI IPA-1",20,0,0,0]
[21,"XI IPA-1",21,0,0,0]
[22,"XI IPA-1",22,0,0,0]
[23,"XI IPA-1",23,0,0,0]
[24,"XI IPA-1",24,0,0,0]
[25,"XI IPA-1",25,0,0,0]
[26,"XI IPA-1",26,0,0,0]
[27,"XI IPA-1",27,0,0,0]
[28,"XI IPA-1",28,0,0,0]
[29,"XI IPA-1",29,0,0,0]
[30,"XI IPA-1",30,0,0,0]
[31,"XI IPA-1",31,0,0,0]
[32,"XI IPA-1",32,0,0,0]
[33,"XI IPA-1",33,0,0,0]
[34,"XI IPA-1",34,0,0,0]
[35,"XI IPA-1",35,0,0,0]
[36,"XI IPA-1",36,0,0,0]
[37,"XI IPA-1",37,0,0,0]
[38,"XI IPA-1",38,0,0,0]
[39,"XI IPA-1",39,0,0,0]
[40,"XI IPA-1",40]
[]
[{"$f":"MAX(A8:A47)","v":40},null,null,null,"Jumlah Laki-laki",{"$f":"COUNTIF(F8:F47,\"L\")","v":1}]
[null,null,null,null,"Jumlah Perempuan",{"$f":"COUNTIF(F8:F47,\"P\")","v":0}]
[null,null,null,null,"Jumlah Total",{"$f":"SUM(F49:F50)","v":1}]
[]
[]
[]
[]
[]
[]
[]
[]
[]
[null,null,"DAFTAR NILAI SISWA"]
[null,null,{"$f":"+MENU!$D$8","v":"SMA NEGERI 5 CILEGON"}]
[null,null,{"$f":"CONCATENATE(MENU!$C$7,\" \",MENU!$D$7)","v":"TAHUN AJARAN 2013-2014"}]
[null,null,"KELAS",null,{"$f":"IF(ISBLANK(A68),\"\",VLOOKUP(A68,Data2,2))","v":"XI IPA-2"}]
[null,null,"NO","NIS","NAMA","L/P","NILAI RAPORT",null,null,"KET"]
[null,null,null,null,null,null,"Kognitif","Afektif","Psikomotor"]
[]
[{"$f":"+'DataBase-XI'!A62","v":46},{"$f":"IF(ISBLANK(A68),\"\",VLOOKUP(A68,Data2,2))","v":"XI IPA-2"},1,{"$f":"IF(ISBLANK(A68),\"\",VLOOKUP(A68,Data2,5))","v":"9966354541"},{"$f":"IF(ISBLANK(A68),\"\",VLOOKUP(A68,Data2,3))","v":"AFID HIDAYAT"},{"$f":"IF(ISBLANK(A68),\"\",VLOOKUP(A68,Data2,6))","v":"L"}]
[{"$f":"+A68+1","v":47},"XI IPA-2",2,0,0,0]
[48,"XI IPA-2",3,0,0,0]
[49,"XI IPA-2",4,0,0,0]
[50,"XI IPA-2",5,0,0,0]
[51,"XI IPA-2",6,0,0,0]
[52,"XI IPA-2",7,0,0,0]
[53,"XI IPA-2",8,0,0,0]
[54,"XI IPA-2",9,0,0,0]
[55,"XI IPA-2",10,0,0,0]
[56,"XI IPA-2",11,0,0,0]
[57,"XI IPA-2",12,0,0,0]
[58,"XI IPA-2",13,0,0,0]
[59,"XI IPA-2",14,0,0,0]
[60,"XI IPA-2",15,0,0,0]
[61,"XI IPA-2",16,0,0,0]
[62,"XI IPA-2",17,0,0,0]
[63,"XI IPA-2",18,0,0,0]
[64,"XI IPA-2",19,0,0,0]
[65,"XI IPA-2",20,0,0,0]
[66,"XI IPA-2",21,0,0,0]
[67,"XI IPA-2",22,0,0,0]
[68,"XI IPA-2",23,0,0,0]
[69,"XI IPA-2",24,0,0,0]
[70,"XI IPA-2",25,0,0,0]
[71,"XI IPA-2",26,0,0,0]
[72,"XI IPA-2",27,0,0,0]
[73,"XI IPA-2",28,0,0,0]
[74,"XI IPA-2",29,0,0,0]
[75,"XI IPA-2",30,0,0,0]
[76,"XI IPA-2",31,0,0,0]
[77,"XI IPA-2",32,0,0,0]
[78,"XI IPA-2",33,0,0,0]
[79,"XI IPA-2",34,0,0,0]
[80,"XI IPA-2",35,0,0,0]
[81,"XI IPA-2",36,0,0,0]
[82,"XI IPA-2",37,0,0,0]
[83,"XI IPA-2",38,0,0,0]
[84,"XI IPA-2",39,0,0,0]
[85,"XI IPA-2",40,0,0,0]
[]
[{"$f":"MAX(A68:A105)","v":83},null,null,null,"Jumlah Laki-laki",{"$f":"COUNTIF(F68:F107,\"L\")","v":1}]
[null,null,null,null,"Jumlah Perempuan",{"$f":"COUNTIF(F68:F107,\"P\")","v":0}]
[null,null,null,null,"Jumlah Total",{"$f":"SUM(F109:F110)","v":1}]
[]
[]
[]
[]
[]
[]
[]
[null,null,"DAFTAR NILAI SISWA"]
[null,null,{"$f":"+MENU!$D$8","v":"SMA NEGERI 5 CILEGON"}]
[null,null,{"$f":"CONCATENATE(MENU!$C$7,\" \",MENU!$D$7)","v":"TAHUN AJARAN 2013-2014"}]
[null,null,"KELAS",null,{"$f":"IF(ISBLANK(A126),\"\",VLOOKUP(A126,Data2,2))","v":"XI IPA-3"}]
[null,null,"NO","NIS","NAMA","L/P","NILAI RAPORT",null,null,"KET"]
[null,null,null,null,null,null,"Kognitif","Afektif","Psikomotor"]
[]
[{"$f":"+'DataBase-XI'!A119","v":91},{"$f":"IF(ISBLANK(A126),\"\",VLOOKUP(A126,Data2,2))","v":"XI IPA-3"},1,{"$f":"IF(ISBLANK(A126),\"\",VLOOKUP(A126,Data2,5))","v":"9966517605"},{"$f":"IF(ISBLANK(A126),\"\",VLOOKUP(A126,Data2,3))","v":"ADE HAIRUNISA MARDIAH"},{"$f":"IF(ISBLANK(A126),\"\",VLOOKUP(A126,Data2,6))","v":"P"}]
[{"$f":"+A126+1","v":92},"XI IPA-3",2,0,0,0]
[93,"XI IPA-3",3,0,0,0]
[94,"XI IPA-3",4,0,0,0]
[95,"XI IPA-3",5,0,0,0]
[96,"XI IPA-3",6,0,0,0]
[97,"XI IPA-3",7,0,0,0]
[98,"XI IPA-3",8,0,0,0]
[99,"XI IPA-3",9,0,0,0]
[100,"XI IPA-3",10,0,0,0]
[101,"XI IPA-3",11,0,0,0]
[102,"XI IPA-3",12,0,0,0]
[103,"XI IPA-3",13,0,0,0]
[104,"XI IPA-3",14,0,0,0]
[105,"XI IPA-3",15,0,0,0]
[106,"XI IPA-3",16,0,0,0]
[107,"XI IPA-3",17,0,0,0]
[108,"XI IPA-3",18,0,0,0]
[109,"XI IPA-3",19,0,0,0]
[110,"XI IPA-3",20,0,0,0]
[111,"XI IPA-3",21,0,0,0]
[112,"XI IPA-3",22,0,0,0]
[113,"XI IPA-3",23,0,0,0]
[114,"XI IPA-3",24,0,0,0]
[115,"XI IPA-3",25,0,0,0]
[116,"XI IPA-3",26,0,0,0]
[117,"XI IPA-3",27,0,0,0]
[118,"XI IPA-3",28,0,0,0]
[119,"XI IPA-3",29,0,0,0]
[120,"XI IPA-3",30,0,0,0]
[121,"XI IPA-3",31,0,0,0]
[122,"XI IPA-3",32,0,0,0]
[123,"XI IPA-3",33,0,0,0]
[124,"XI IPA-3",34,0,0,0]
[125,"XI IPA-3",35,0,0,0]
[{"$f":"+A160+1","v":126},"XI IPA-3",36,0,0,0]
[{"$f":"+A161+1","v":127},"XI IPA-3",37,0,0,0]
[{"$f":"+A162+1","v":128},"XI IPA-3",38,0,0,0]
[{"$f":"+A163+1","v":129},"XI IPA-3",39,0,0,0]
[{"$f":"+A164+1","v":130},"XI IPA-3",40,0,0,0]
[]
[{"$f":"MAX(A126:A164)","v":129},null,null,null,"Jumlah Laki-laki",{"$f":"COUNTIF(F126:F165,\"L\")","v":0}]
[null,null,null,null,"Jumlah Perempuan",{"$f":"COUNTIF(F126:F165,\"P\")","v":1}]
[null,null,null,null,"Jumlah Total",{"$f":"SUM(F167:F168)","v":1}]
[]
[]
[]
[]
[]
[]
[]
[]
[]
[null,null,"DAFTAR NILAI SISWA"]
[null,null,{"$f":"+MENU!$D$8","v":"SMA NEGERI 5 CILEGON"}]
[null,null,{"$f":"CONCATENATE(MENU!$C$7,\" \",MENU!$D$7)","v":"TAHUN AJARAN 2013-2014"}]
[null,null,"KELAS",null,{"$f":"IF(ISBLANK(A186),\"\",VLOOKUP(A186,Data2,2))","v":"XI IPS-1"}]
[null,null,"NO","NIS","NAMA","L/P","NILAI RAPORT",null,null,"KET"]
[null,null,null,null,null,null,"Kognitif","Afektif","Psikomotor"]
[]
[{"$f":"+'DataBase-XI'!A176","v":136},{"$f":"IF(ISBLANK(A186),\"\",VLOOKUP(A186,Data2,2))","v":"XI IPS-1"},1,{"$f":"IF(ISBLANK(A186),\"\",VLOOKUP(A186,Data2,5))","v":"9970454991"},{"$f":"IF(ISBLANK(A186),\"\",VLOOKUP(A186,Data2,3))","v":"AAM TAMIMI"},{"$f":"IF(ISBLANK(A186),\"\",VLOOKUP(A186,Data2,6))","v":"L"}]
[{"$f":"+A186+1","v":137},"XI IPS-1",2,0,0,0]
[138,"XI IPS-1",3,0,0,0]
[139,"XI IPS-1",4,0,0,0]
[140,"XI IPS-1",5,0,0,0]
[141,"XI IPS-1",6,0,0,0]
[142,"XI IPS-1",7,0,0,0]
[143,"XI IPS-1",8,0,0,0]
[144,"XI IPS-1",9,0,0,0]
[145,"XI IPS-1",10,0,0,0]
[146,"XI IPS-1",11,0,0,0]
[147,"XI IPS-1",12,0,0,0]
[148,"XI IPS-1",13,0,0,0]
[149,"XI IPS-1",14,0,0,0]
[150,"XI IPS-1",15,0,0,0]
[151,"XI IPS-1",16,0,0,0]
[152,"XI IPS-1",17,0,0,0]
[153,"XI IPS-1",18,0,0,0]
[154,"XI IPS-1",19,0,0,0]
[155,"XI IPS-1",20,0,0,0]
[156,"XI IPS-1",21,0,0,0]
[157,"XI IPS-1",22,0,0,0]
[158,"XI IPS-1",23,0,0,0]
[159,"XI IPS-1",24,0,0,0]
[160,"XI IPS-1",25,0,0,0]
[161,"XI IPS-1",26,0,0,0]
[162,"XI IPS-1",27,0,0,0]
[163,"XI IPS-1",28,0,0,0]
[164,"XI IPS-1",29,0,0,0]
[165,"XI IPS-1",30,0,0,0]
[166,"XI IPS-1",31,0,0,0]
[167,"XI IPS-1",32,0,0,0]
[168,"XI IPS-1",33,0,0,0]
[169,"XI IPS-1",34,0,0,0]
[170,"XI IPS-1",35,0,0,0]
[{"$f":"+A220+1","v":171},"XI IPS-1",36,0,0,0]
[{"$f":"+A221+1","v":172},"XI IPS-1",37,0,0,0]
[{"$f":"+A222+1","v":173},"XI IPS-1",38,0,0,0]
[{"$f":"+A223+1","v":174},"XI IPS-1",39,0,0,0]
[{"$f":"+A224+1","v":175},"XI IPS-1",40,0,0,0]
[]
[{"$f":"MAX(A186:A224)","v":174},null,null,null,"Jumlah Laki-laki",{"$f":"COUNTIF(F186:F225,\"L\")","v":1}]
[null,null,null,null,"Jumlah Perempuan",{"$f":"COUNTIF(F186:F225,\"P\")","v":0}]
[null,null,null,null,"Jumlah Total",{"$f":"SUM(F227:F228)","v":1}]
[]
[]
[]
[]
[]
[]
[]
[]
[]
[null,null,"DAFTAR NILAI SISWA"]
[null,null,{"$f":"+MENU!$D$8","v":"SMA NEGERI 5 CILEGON"}]
[null,null,{"$f":"CONCATENATE(MENU!$C$7,\" \",MENU!$D$7)","v":"TAHUN AJARAN 2013-2014"}]
[null,null,"KELAS",null,{"$f":"IF(ISBLANK(A246),\"\",VLOOKUP(A246,Data2,2))","v":"XI IPS-2"}]
[null,null,"NO","NIS","NAMA","L/P","NILAI RAPORT",null,null,"KET"]
[null,null,null,null,null,null,"Kognitif","Afektif","Psikomotor"]
[]
[{"$f":"+'DataBase-XI'!A233","v":181},{"$f":"IF(ISBLANK(A246),\"\",VLOOKUP(A246,Data2,2))","v":"XI IPS-2"},1,{"$f":"IF(ISBLANK(A246),\"\",VLOOKUP(A246,Data2,5))","v":"9970454708"},{"$f":"IF(ISBLANK(A246),\"\",VLOOKUP(A246,Data2,3))","v":"AGUS RAHAYU"},{"$f":"IF(ISBLANK(A246),\"\",VLOOKUP(A246,Data2,6))","v":"P"}]
[{"$f":"+A246+1","v":182},"XI IPS-2",2,0,0,0]
[183,"XI IPS-2",3,0,0,0]
[184,"XI IPS-2",4,0,0,0]
[185,"XI IPS-2",5,0,0,0]
[186,"XI IPS-2",6,0,0,0]
[187,"XI IPS-2",7,0,0,0]
[188,"XI IPS-2",8,0,0,0]
[189,"XI IPS-2",9,0,0,0]
[190,"XI IPS-2",10,0,0,0]
[191,"XI IPS-2",11,0,0,0]
[192,"XI IPS-2",12,0,0,0]
[193,"XI IPS-2",13,0,0,0]
[194,"XI IPS-2",14,0,0,0]
[195,"XI IPS-2",15,0,0,0]
[196,"XI IPS-2",16,0,0,0]
[197,"XI IPS-2",17,0,0,0]
[198,"XI IPS-2",18,0,0,0]
[199,"XI IPS-2",19,0,0,0]
[200,"XI IPS-2",20,0,0,0]
[201,"XI IPS-2",21,0,0,0]
[202,"XI IPS-2",22,0,0,0]
[203,"XI IPS-2",23,0,0,0]
[204,"XI IPS-2",24,0,0,0]
[205,"XI IPS-2",25,0,0,0]
[206,"XI IPS-2",26,0,0,0]
[207,"XI IPS-2",27,0,0,0]
[208,"XI IPS-2",28,0,0,0]
[209,"XI IPS-2",29,0,0,0]
[210,"XI IPS-2",30,0,0,0]
[211,"XI IPS-2",31,0,0,0]
[212,"XI IPS-2",32,0,0,0]
[213,"XI IPS-2",33,0,0,0]
[214,"XI IPS-2",34,0,0,0]
[215,"XI IPS-2",35,0,0,0]
[{"$f":"+A280+1","v":216},"XI IPS-2",36,0,0,0]
[{"$f":"+A281+1","v":217},"XI IPS-2",37,0,0,0]
[{"$f":"+A282+1","v":218},"XI IPS-2",38,0,0,0]
[{"$f":"+A283+1","v":219},"XI IPS-2",39,0,0,0]
[{"$f":"+A284+1","v":220},"XI IPS-2",40,0,0,0]
[]
[{"$f":"MAX(A246:A285)","v":220},null,null,null,"Jumlah Laki-laki",{"$f":"COUNTIF(F245:F285,\"L\")","v":0}]
[null,null,null,null,"Jumlah Perempuan",{"$f":"COUNTIF(F245:F285,\"P\")","v":1}]
[null,null,null,null,"Jumlah Total",{"$f":"SUM(F287:F288)","v":1}]
[]
[]
[]
[]
[]
[]
[]
[]
[]
[null,null,"DAFTAR NILAI SISWA"]
[null,null,{"$f":"+MENU!$D$8","v":"SMA NEGERI 5 CILEGON"}]
[null,null,{"$f":"CONCATENATE(MENU!$C$7,\" \",MENU!$D$7)","v":"TAHUN AJARAN 2013-2014"}]
[null,null,"KELAS",null,{"$f":"IF(ISBLANK(A306),\"\",VLOOKUP(A306,Data2,2))","v":"XI IPS-3"}]
[null,null,"NO","NIS","NAMA","L/P","NILAI RAPORT",null,null,"KET"]
[null,null,null,null,null,null,"Kognitif","Afektif","Psikomotor"]
[]
[{"$f":"+'DataBase-XI'!A290","v":226},{"$f":"IF(ISBLANK(A306),\"\",VLOOKUP(A306,Data2,2))","v":"XI IPS-3"},1,{"$f":"IF(ISBLANK(A306),\"\",VLOOKUP(A306,Data2,5))","v":"9965299861"},{"$f":"IF(ISBLANK(A306),\"\",VLOOKUP(A306,Data2,3))","v":"ABDUL WAHID"},{"$f":"IF(ISBLANK(A306),\"\",VLOOKUP(A306,Data2,6))","v":"L"}]
[{"$f":"+A306+1","v":227},"XI IPS-3",2,0,0,0]
[228,"XI IPS-3",3,0,0,0]
[229,"XI IPS-3",4,0,0,0]
[230,"XI IPS-3",5,0,0,0]
[231,"XI IPS-3",6,0,0,0]
[232,"XI IPS-3",7,0,0,0]
[233,"XI IPS-3",8,0,0,0]
[234,"XI IPS-3",9,0,0,0]
[235,"XI IPS-3",10,0,0,0]
[236,"XI IPS-3",11,0,0,0]
[237,"XI IPS-3",12,0,0,0]
[238,"XI IPS-3",13,0,0,0]
[239,"XI IPS-3",14,0,0,0]
[240,"XI IPS-3",15,0,0,0]
[241,"XI IPS-3",16,0,0,0]
[242,"XI IPS-3",17,0,0,0]
[243,"XI IPS-3",18,0,0,0]
[244,"XI IPS-3",19,0,0,0]
[245,"XI IPS-3",20,0,0,0]
[246,"XI IPS-3",21,0,0,0]
[247,"XI IPS-3",22,0,0,0]
[248,"XI IPS-3",23,0,0,0]
[249,"XI IPS-3",24,0,0,0]
[250,"XI IPS-3",25,0,0,0]
[251,"XI IPS-3",26,0,0,0]
[252,"XI IPS-3",27,0,0,0]
[253,"XI IPS-3",28,0,0,0]
[254,"XI IPS-3",29,0,0,0]
[255,"XI IPS-3",30,0,0,0]
[256,"XI IPS-3",31,0,0,0]
[257,"XI IPS-3",32,0,0,0]
[258,"XI IPS-3",33,0,0,0]
[259,"XI IPS-3",34,0,0,0]
[260,"XI IPS-3",35,0,0,0]
[{"$f":"+A340+1","v":261},"XI IPS-3",null,0,0,0]
[{"$f":"+A341+1","v":262},"XI IPS-3",null,0,0,0]
[{"$f":"+A342+1","v":263},"XI IPS-3",null,0,0,0]
[{"$f":"+A343+1","v":264},"XI IPS-3",null,0,0,0]
[{"$f":"+A344+1","v":265},"XI IPS-3",null,0,0,0]
[]
[null,null,null,null,"Jumlah Laki-laki",{"$f":"COUNTIF(F305:F345,\"L\")","v":1}]
[null,null,null,null,"Jumlah Perempuan",{"$f":"COUNTIF(F305:F345,\"P\")","v":0}]
[null,null,null,null,"Jumlah Total",{"$f":"SUM(F347:F348)","v":1}]

{"sheet":"Blanko-Daf Nilai XI","index":11,"n_rows":380,"n_cols":18,"rows_kept":380,"cut":false,"hidden":false,"merged":[[0,0,8,0],[0,2,0,15],[1,2,1,15],[2,2,2,15],[6,2,8,2],[6,3,8,3],[6,4,8,4],[6,5,8,5],[6,6,7,11],[6,12,8,12],[6,13,7,14],[6,15,8,15],[64,2,64,15],[65,2,65,15],[66,2,66,15],[70,2,72,2],[70,3,72,3],[70,4,72,4],[70,5,72,5],[70,6,71,11],[70,12,72,12],[70,13,71,14],[70,15,72,15],[128,2,128,15],[129,2,129,15],[130,2,130,15],[134,2,136,2],[134,3,136,3],[134,4,136,4],[134,5,136,5],[134,6,135,11],[134,12,136,12],[134,13,135,14],[134,15,136,15],[198,15,200,15],[256,2,256,15],[257,2,257,15],[258,2,258,15],[192,2,192,15],[193,2,193,15],[194,2,194,15],[198,2,200,2],[198,3,200,3],[198,4,200,4],[198,5,200,5],[198,6,199,11],[262,5,264,5],[262,6,263,11],[262,12,264,12],[198,12,200,12],[198,13,199,14],[326,12,328,12],[326,13,327,14],[326,15,328,15],[262,13,263,14],[262,15,264,15],[320,2,320,15],[321,2,321,15],[322,2,322,15],[326,2,328,2],[326,3,328,3],[326,4,328,4],[326,5,328,5],[326,6,327,11],[262,2,264,2],[262,3,264,3],[262,4,264,4]]}
["NO URUT DATABASE",null,"DAFTAR NILAI MURNI"]
[null,null,{"$f":"+MENU!$D$8","v":"SMA NEGERI 5 CILEGON"}]
[null,null,{"$f":"CONCATENATE(MENU!$C$7,\" \",MENU!$D$7)","v":"TAHUN AJARAN 2013-2014"}]
[]
[null,null,"MATA PELAJARAN",null,";",null,null,null,null,null,null,null,"Kelas/Semester:",null,null,{"$f":"+B10","v":"XI IPA-1"}]
[null,null,"NAMA SEKOLAH",null,{"$f":"+$C$2","v":"SMA NEGERI 5 CILEGON"}]
[null,null,"NO","NAMA SISWA","NISN","L/P","NILAI HARIAN / TUGAS",null,null,null,null,null,"RATA-RATA","KETUNTASAN",null,"KET"]
[]
[null,null,null,null,null,null,1,2,3,4,5,6,null,"YA","TIDAK"]
[{"$f":"+'DataBase-XI'!A5","v":1},{"$f":"IF(ISBLANK(A10),\"\",VLOOKUP(A10,Data2,2))","v":"XI IPA-1"},1,{"$f":"IF(ISBLANK(A10),\"\",VLOOKUP(A10,Data2,3))","v":"AL HEELAL IDHANA"},{"$f":"IF(ISBLANK(A10),\"\",VLOOKUP(A10,Data2,5))","v":9907455968},{"$f":"IF(ISBLANK(A10),\"\",VLOOKUP(A10,Data2,6))","v":"L"}]
[2,"XI IPA-1",2,0,0,0]
[3,"XI IPA-1",3,0,0,0]
[4,"XI IPA-1",4,0,0,0]
[5,"XI IPA-1",5,0,0,0]
[6,"XI IPA-1",6,0,0,0]
[7,"XI IPA-1",7,0,0,0]
[8,"XI IPA-1",8,0,0,0]
[9,"XI IPA-1",9,0,0,0]
[10,"XI IPA-1",10,0,0,0]
[11,"XI IPA-1",11,0,0,0]
[12,"XI IPA-1",12,0,0,0]
[13,"XI IPA-1",13,0,0,0]
[14,"XI IPA-1",14,0,0,0]
[15,"XI IPA-1",15,0,0,0]
[16,"XI IPA-1",16,0,0,0]
[17,"XI IPA-1",17,0,0,0]
[18,"XI IPA-1",18,0,0,0]
[19,"XI IPA-1",19,0,0,0]
[20,"XI IPA-1",20,0,0,0]
[21,"XI IPA-1",21,0,0,0]
[22,"XI IPA-1",22,0,0,0]
[23,"XI IPA-1",23,0,0,0]
[24,"XI IPA-1",24,0,0,0]
[25,"XI IPA-1",25,0,0,0]
[26,"XI IPA-1",26,0,0,0]
[27,"XI IPA-1",27,0,0,0]
[28,"XI IPA-1",28,0,0,0]
[29,"XI IPA-1",29,0,0,0]
[30,"XI IPA-1",30,0,0,0]
[31,"XI IPA-1",31,0,0,0]
[32,"XI IPA-1",32,0,0,0]
[33,"XI IPA-1",33,0,0,0]
[34,"XI IPA-1",34,0,0,0]
[35,"XI IPA-1",35,0,0,0]
[36,"XI IPA-1",36,0,0,0]
[37,"XI IPA-1",37,0,0,0]
[38,"XI IPA-1",38,0,0,0]
[39,"XI IPA-1",39,0,0,0]
[40,"XI IPA-1",40,0,0,0]
[null,null,null,"Mengetahui",null,null,null,null,null,null,null,null,{"$f":"CONCATENATE(MENU!$D$13,\" ,   \",R50)","v":"Cilegon ,   24 Juli 2013"},null,null,null,null,{"$f":"TEXT(NOW(),\"dd mmmm yyyy\")","v":"24 Juli 2013"}]
[{"$f":"MAX(A10:A47)","v":38},null,null,"Waka Kurikulum",null,null,null,null,null,null,null,null,"Guru Bidang Study"]
[]
[]
[null,null,null,"................................",null,null,null,null,null,null,null,null,"................................"]
[null,null,null,"NIP: ",null,null,"Mengetahui",null,null,null,null,null,"NIP: "]
[null,null,null,null,null,null,"Kepala Sekolah"]
[]
[]
[null,null,null,null,null,null,{"$f":"+[1]MENU!$C$16","v":"Asep Mansur,S.Pd"}]
[null,null,null,null,null,null,{"$f":"+[1]MENU!$C$17","v":"NIP: 19620101 198512 1 004"}]
[]
[]
[]
[]
[null,null,"DAFTAR NILAI MURNI"]
[null,null,{"$f":"+$C$2","v":"SMA NEGERI 5 CILEGON"}]
[null,null,{"$f":"+$C$3","v":"TAHUN AJARAN 2013-2014"}]
[]
[null,null,"MATA PELAJARAN",null,";",null,null,null,null,null,null,null,"Kelas/Semester:",null,null,{"$f":"+B74","v":"XI IPA-2"}]
[null,null,"NAMA SEKOLAH",null,{"$f":"+$C$2","v":"SMA NEGERI 5 CILEGON"}]
[null,null,"NO","NAMA SISWA","NISN","L/P","NILAI HARIAN / TUGAS",null,null,null,null,null,"RATA-RATA","KETUNTASAN",null,"KET"]
[]
[null,null,null,null,null,null,1,2,3,4,5,6,null,"YA","TIDAK"]
[{"$f":"+'DataBase-XI'!A62","v":46},{"$f":"IF(ISBLANK(A74),\"\",VLOOKUP(A74,Data2,2))","v":"XI IPA-2"},1,{"$f":"IF(ISBLANK(A74),\"\",VLOOKUP(A74,Data2,3))","v":"AFID HIDAYAT"},{"$f":"IF(ISBLANK(A74),\"\",VLOOKUP(A74,Data2,5))","v":"9966354541"},{"$f":"IF(ISBLANK(A74),\"\",VLOOKUP(A74,Data2,6))","v":"L"}]
[{"$f":"+A74+1","v":47},"XI IPA-2",2,0,0,0]
[48,"XI IPA-2",3,0,0,0]
[49,"XI IPA-2",4,0,0,0]
[50,"XI IPA-2",5,0,0,0]
[51,"XI IPA-2",6,0,0,0]
[52,"XI IPA-2",7,0,0,0]
[53,"XI IPA-2",8,0,0,0]
[54,"XI IPA-2",9,0,0,0]
[55,"XI IPA-2",10,0,0,0]
[56,"XI IPA-2",11,0,0,0]
[57,"XI IPA-2",12,0,0,0]
[58,"XI IPA-2",13,0,0,0]
[59,"XI IPA-2",14,0,0,0]
[60,"XI IPA-2",15,0,0,0]
[61,"XI IPA-2",16,0,0,0]
[62,"XI IPA-2",17,0,0,0]
[63,"XI IPA-2",18,0,0,0]
[64,"XI IPA-2",19,0,0,0]
[65,"XI IPA-2",20,0,0,0]
[66,"XI IPA-2",21,0,0,0]
[67,"XI IPA-2",22,0,0,0]
[68,"XI IPA-2",23,0,0,0]
[69,"XI IPA-2",24,0,0,0]
[70,"XI IPA-2",25,0,0,0]
[71,"XI IPA-2",26,0,0,0]
[72,"XI IPA-2",27,0,0,0]
[73,"XI IPA-2",28,0,0,0]
[74,"XI IPA-2",29,0,0,0]
[75,"XI IPA-2",30,0,0,0]
[76,"XI IPA-2",31,0,0,0]
[77,"XI IPA-2",32,0,0,0]
[78,"XI IPA-2",33,0,0,0]
[79,"XI IPA-2",34,0,0,0]
[80,"XI IPA-2",35,0,0,0]
[81,"XI IPA-2",36,0,0,0]
[82,"XI IPA-2",37,0,0,0]
[{"$f":"+A110+1","v":83},"XI IPA-2",38,0,0,0]
[{"$f":"+A111+1","v":84},"XI IPA-2",39,0,0,0]
[{"$f":"+A112+1","v":85},"XI IPA-2",40,0,0,0]
[null,null,null,"Mengetahui",null,null,null,null,null,null,null,null,{"$f":"CONCATENATE(MENU!$D$13,\" ,   \",R114)","v":"Cilegon ,   24 Juli 2013"},null,null,null,null,{"$f":"TEXT(NOW(),\"dd mmmm yyyy\")","v":"24 Juli 2013"}]
[{"$f":"MAX(A74:A112)","v":84},null,null,"Waka Kurikulum",null,null,null,null,null,null,null,null,"Guru Bidang Study"]
[]
[]
[null,null,null,"................................",null,null,null,null,null,null,null,null,"................................"]
[null,null,null,"NIP: ",null,null,"Mengetahui",null,null,null,null,null,"NIP: "]
[null,null,null,null,null,null,"Kepala Sekolah"]
[]
[]
[null,null,null,null,null,null,{"$f":"+[1]MENU!$C$16","v":"Asep Mansur,S.Pd"}]
[null,null,null,null,null,null,{"$f":"+[1]MENU!$C$17","v":"NIP: 19620101 198512 1 004"}]
[]
[]
[]
[]
[null,null,"DAFTAR NILAI MURNI"]
[null,null,{"$f":"+$C$2","v":"SMA NEGERI 5 CILEGON"}]
[null,null,{"$f":"+$C$3","v":"TAHUN AJARAN 2013-2014"}]
[]
[null,null,"MATA PELAJARAN",null,";",null,null,null,null,null,null,null,"Kelas/Semester:",null,null,{"$f":"+B138","v":"XI IPA-3"}]
[null,null,"NAMA SEKOLAH",null,{"$f":"+$C$2","v":"SMA NEGERI 5 CILEGON"}]
[null,null,"NO","NAMA SISWA","NISN","L/P","NILAI HARIAN / TUGAS",null,null,null,null,null,"RATA-RATA","KETUNTASAN",null,"KET"]
[]
[null,null,null,null,null,null,1,2,3,4,5,6,null,"YA","TIDAK"]
[{"$f":"+'DataBase-XI'!A119","v":91},{"$f":"IF(ISBLANK(A138),\"\",VLOOKUP(A138,Data2,2))","v":"XI IPA-3"},1,{"$f":"IF(ISBLANK(A138),\"\",VLOOKUP(A138,Data2,3))","v":"ADE HAIRUNISA MARDIAH"},{"$f":"IF(ISBLANK(A138),\"\",VLOOKUP(A138,Data2,5))","v":"9966517605"},{"$f":"IF(ISBLANK(A138),\"\",VLOOKUP(A138,Data2,6))","v":"P"}]
[{"$f":"+A138+1","v":92},"XI IPA-3",2,0,0,0]
[93,"XI IPA-3",3,0,0,0]
[94,"XI IPA-3",4,0,0,0]
[95,"XI IPA-3",5,0,0,0]
[96,"XI IPA-3",6,0,0,0]
[97,"XI IPA-3",7,0,0,0]
[98,"XI IPA-3",8,0,0,0]
[99,"XI IPA-3",9,0,0,0]
[100,"XI IPA-3",10,0,0,0]
[101,"XI IPA-3",11,0,0,0]
[102,"XI IPA-3",12,0,0,0]
[103,"XI IPA-3",13,0,0,0]
[104,"XI IPA-3",14,0,0,0]
[105,"XI IPA-3",15,0,0,0]
[106,"XI IPA-3",16,0,0,0]
[107,"XI IPA-3",17,0,0,0]
[108,"XI IPA-3",18,0,0,0]
[109,"XI IPA-3",19,0,0,0]
[110,"XI IPA-3",20,0,0,0]
[111,"XI IPA-3",21,0,0,0]
[112,"XI IPA-3",22,0,0,0]
[113,"XI IPA-3",23,0,0,0]
[114,"XI IPA-3",24,0,0,0]
[115,"XI IPA-3",25,0,0,0]
[116,"XI IPA-3",26,0,0,0]
[117,"XI IPA-3",27,0,0,0]
[118,"XI IPA-3",28,0,0,0]
[119,"XI IPA-3",29,0,0,0]
[120,"XI IPA-3",30,0,0,0]
[121,"XI IPA-3",31,0,0,0]
[122,"XI IPA-3",32,0,0,0]
[123,"XI IPA-3",33,0,0,0]
[124,"XI IPA-3",34,0,0,0]
[125,"XI IPA-3",35,0,0,0]
[{"$f":"+A172+1","v":126},"XI IPA-3",36,0,0,0]
[{"$f":"+A173+1","v":127},"XI IPA-3",37,0,0,0]
[{"$f":"+A174+1","v":128},"XI IPA-3",38,0,0,0]
[{"$f":"+A175+1","v":129},"XI IPA-3",39,0,0,0]
[{"$f":"+A176+1","v":130},"XI IPA-3",40,0,0,0]
[null,null,null,"Mengetahui",null,null,null,null,null,null,null,null,{"$f":"CONCATENATE(MENU!$D$13,\" ,   \",R178)","v":"Cilegon ,   24 Juli 2013"},null,null,null,null,{"$f":"TEXT(NOW(),\"dd mmmm yyyy\")","v":"24 Juli 2013"}]
[{"$f":"MAX(A138:A176)","v":129},null,null,"Waka Kurikulum",null,null,null,null,null,null,null,null,"Guru Bidang Study"]
[]
[]
[null,null,null,"................................",null,null,null,null,null,null,null,null,"................................"]
[null,null,null,"NIP: ",null,null,"Mengetahui",null,null,null,null,null,"NIP: "]
[null,null,null,null,null,null,"Kepala Sekolah"]
[]
[]
[null,null,null,null,null,null,{"$f":"+[1]MENU!$C$16","v":"Asep Mansur,S.Pd"}]
[null,null,null,null,null,null,{"$f":"+[1]MENU!$C$17","v":"NIP: 19620101 198512 1 004"}]
[]
[]
[]
[]
[null,null,"DAFTAR NILAI MURNI"]
[null,null,{"$f":"+$C$2","v":"SMA NEGERI 5 CILEGON"}]
[null,null,{"$f":"+$C$3","v":"TAHUN AJARAN 2013-2014"}]
[]
[null,null,"MATA PELAJARAN",null,";",null,null,null,null,null,null,null,"Kelas/Semester:",null,null,{"$f":"+B202","v":"XI IPS-1"}]
[null,null,"NAMA SEKOLAH",null,{"$f":"+$C$2","v":"SMA NEGERI 5 CILEGON"}]
[null,null,"NO","NAMA SISWA","NISN","L/P","NILAI HARIAN / TUGAS",null,null,null,null,null,"RATA-RATA","KETUNTASAN",null,"KET"]
[]
[null,null,null,null,null,null,1,2,3,4,5,6,null,"YA","TIDAK"]
[{"$f":"+'DataBase-XI'!A176","v":136},{"$f":"IF(ISBLANK(A202),\"\",VLOOKUP(A202,Data2,2))","v":"XI IPS-1"},1,{"$f":"IF(ISBLANK(A202),\"\",VLOOKUP(A202,Data2,3))","v":"AAM TAMIMI"},{"$f":"IF(ISBLANK(A202),\"\",VLOOKUP(A202,Data2,5))","v":"9970454991"},{"$f":"IF(ISBLANK(A202),\"\",VLOOKUP(A202,Data2,6))","v":"L"}]
[{"$f":"+A202+1","v":137},"XI IPS-1",2,0,0,0]
[138,"XI IPS-1",3,0,0,0]
[139,"XI IPS-1",4,0,0,0]
[140,"XI IPS-1",5,0,0,0]
[141,"XI IPS-1",6,0,0,0]
[142,"XI IPS-1",7,0,0,0]
[143,"XI IPS-1",8,0,0,0]
[144,"XI IPS-1",9,0,0,0]
[145,"XI IPS-1",10,0,0,0]
[146,"XI IPS-1",11,0,0,0]
[147,"XI IPS-1",12,0,0,0]
[148,"XI IPS-1",13,0,0,0]
[149,"XI IPS-1",14,0,0,0]
[150,"XI IPS-1",15,0,0,0]
[151,"XI IPS-1",16,0,0,0]
[152,"XI IPS-1",17,0,0,0]
[153,"XI IPS-1",18,0,0,0]
[154,"XI IPS-1",19,0,0,0]
[155,"XI IPS-1",20,0,0,0]
[156,"XI IPS-1",21,0,0,0]
[157,"XI IPS-1",22,0,0,0]
[158,"XI IPS-1",23,0,0,0]
[159,"XI IPS-1",24,0,0,0]
[160,"XI IPS-1",25,0,0,0]
[161,"XI IPS-1",26,0,0,0]
[162,"XI IPS-1",27,0,0,0]
[163,"XI IPS-1",28,0,0,0]
[164,"XI IPS-1",29,0,0,0]
[165,"XI IPS-1",30,0,0,0]
[166,"XI IPS-1",31,0,0,0]
[167,"XI IPS-1",32,0,0,0]
[168,"XI IPS-1",33,0,0,0]
[169,"XI IPS-1",34,0,0,0]
[170,"XI IPS-1",35,0,0,0]
[{"$f":"+A236+1","v":171},"XI IPS-1",36,0,0,0]
[{"$f":"+A237+1","v":172},"XI IPS-1",37,0,0,0]
[{"$f":"+A238+1","v":173},"XI IPS-1",38,0,0,0]
[{"$f":"+A239+1","v":174},"XI IPS-1",39,0,0,0]
[{"$f":"+A240+1","v":175},"XI IPS-1",40,0,0,0]
[null,null,null,"Mengetahui",null,null,null,null,null,null,null,null,{"$f":"CONCATENATE(MENU!$D$13,\" ,   \",R242)","v":"Cilegon ,   24 Juli 2013"},null,null,null,null,{"$f":"TEXT(NOW(),\"dd mmmm yyyy\")","v":"24 Juli 2013"}]
[{"$f":"MAX(A202:A240)","v":174},null,null,"Waka Kurikulum",null,null,null,null,null,null,null,null,"Guru Bidang Study"]
[]
[]
[null,null,null,"................................",null,null,null,null,null,null,null,null,"................................"]
[null,null,null,"NIP: ",null,null,"Mengetahui",null,null,null,null,null,"NIP: "]
[null,null,null,null,null,null,"Kepala Sekolah"]
[]
[]
[null,null,null,null,null,null,{"$f":"+[1]MENU!$C$16","v":"Asep Mansur,S.Pd"}]
[null,null,null,null,null,null,{"$f":"+[1]MENU!$C$17","v":"NIP: 19620101 198512 1 004"}]
[]
[]
[]
[]
[null,null,"DAFTAR NILAI MURNI"]
[null,null,{"$f":"+$C$2","v":"SMA NEGERI 5 CILEGON"}]
[null,null,{"$f":"+$C$3","v":"TAHUN AJARAN 2013-2014"}]
[]
[null,null,"MATA PELAJARAN",null,";",null,null,null,null,null,null,null,"Kelas/Semester:",null,null,{"$f":"+B266","v":"XI IPS-2"}]
[null,null,"NAMA SEKOLAH",null,{"$f":"+$C$2","v":"SMA NEGERI 5 CILEGON"}]
[null,null,"NO","NAMA SISWA","NISN","L/P","NILAI HARIAN / TUGAS",null,null,null,null,null,"RATA-RATA","KETUNTASAN",null,"KET"]
[]
[null,null,null,null,null,null,1,2,3,4,5,6,null,"YA","TIDAK"]
[{"$f":"+'DataBase-XI'!A233","v":181},{"$f":"IF(ISBLANK(A266),\"\",VLOOKUP(A266,Data2,2))","v":"XI IPS-2"},1,{"$f":"IF(ISBLANK(A266),\"\",VLOOKUP(A266,Data2,3))","v":"AGUS RAHAYU"},{"$f":"IF(ISBLANK(A266),\"\",VLOOKUP(A266,Data2,5))","v":"9970454708"},{"$f":"IF(ISBLANK(A266),\"\",VLOOKUP(A266,Data2,6))","v":"P"}]
[{"$f":"+A266+1","v":182},"XI IPS-2",2,0,0,0]
[183,"XI IPS-2",3,0,0,0]
[184,"XI IPS-2",4,0,0,0]
[185,"XI IPS-2",5,0,0,0]
[186,"XI IPS-2",6,0,0,0]
[187,"XI IPS-2",7,0,0,0]
[188,"XI IPS-2",8,0,0,0]
[189,"XI IPS-2",9,0,0,0]
[190,"XI IPS-2",10,0,0,0]
[191,"XI IPS-2",11,0,0,0]
[192,"XI IPS-2",12,0,0,0]
[193,"XI IPS-2",13,0,0,0]
[194,"XI IPS-2",14,0,0,0]
[195,"XI IPS-2",15,0,0,0]
[196,"XI IPS-2",16,0,0,0]
[197,"XI IPS-2",17,0,0,0]
[198,"XI IPS-2",18,0,0,0]
[199,"XI IPS-2",19,0,0,0]
[200,"XI IPS-2",20,0,0,0]
[201,"XI IPS-2",21,0,0,0]
[202,"XI IPS-2",22,0,0,0]
[203,"XI IPS-2",23,0,0,0]
[204,"XI IPS-2",24,0,0,0]
[205,"XI IPS-2",25,0,0,0]
[206,"XI IPS-2",26,0,0,0]
[207,"XI IPS-2",27,0,0,0]
[208,"XI IPS-2",28,0,0,0]
[209,"XI IPS-2",29,0,0,0]
[210,"XI IPS-2",30,0,0,0]
[211,"XI IPS-2",31,0,0,0]
[212,"XI IPS-2",32,0,0,0]
[213,"XI IPS-2",33,0,0,0]
[214,"XI IPS-2",34,0,0,0]
[215,"XI IPS-2",35,0,0,0]
[{"$f":"+A300+1","v":216},"XI IPS-2",36,0,0,0]
[{"$f":"+A301+1","v":217},"XI IPS-2",37,0,0,0]
[{"$f":"+A302+1","v":218},"XI IPS-2",38,0,0,0]
[{"$f":"+A303+1","v":219},"XI IPS-2",39,0,0,0]
[{"$f":"+A304+1","v":220},"XI IPS-2",40,0,0,0]
[null,null,null,"Mengetahui",null,null,null,null,null,null,null,null,{"$f":"CONCATENATE(MENU!$D$13,\" ,   \",R306)","v":"Cilegon ,   24 Juli 2013"},null,null,null,null,{"$f":"TEXT(NOW(),\"dd mmmm yyyy\")","v":"24 Juli 2013"}]
[{"$f":"MAX(A266:A305)","v":220},null,null,"Waka Kurikulum",null,null,null,null,null,null,null,null,"Guru Bidang Study"]
[]
[]
[null,null,null,"................................",null,null,null,null,null,null,null,null,"................................"]
[null,null,null,"NIP: ",null,null,"Mengetahui",null,null,null,null,null,"NIP: "]
[null,null,null,null,null,null,"Kepala Sekolah"]
[]
[]
[null,null,null,null,null,null,{"$f":"+[1]MENU!$C$16","v":"Asep Mansur,S.Pd"}]
[null,null,null,null,null,null,{"$f":"+[1]MENU!$C$17","v":"NIP: 19620101 198512 1 004"}]
[]
[]
[]
[]
[null,null,"DAFTAR NILAI MURNI"]
[null,null,{"$f":"+$C$2","v":"SMA NEGERI 5 CILEGON"}]
[null,null,{"$f":"+$C$3","v":"TAHUN AJARAN 2013-2014"}]
[]
[null,null,"MATA PELAJARAN",null,";",null,null,null,null,null,null,null,"Kelas/Semester:",null,null,{"$f":"+B330","v":"XI IPS-3"}]
[null,null,"NAMA SEKOLAH",null,{"$f":"+$C$2","v":"SMA NEGERI 5 CILEGON"}]
[null,null,"NO","NAMA SISWA","NISN","L/P","NILAI HARIAN / TUGAS",null,null,null,null,null,"RATA-RATA","KETUNTASAN",null,"KET"]
[]
[null,null,null,null,null,null,1,2,3,4,5,6,null,"YA","TIDAK"]
[{"$f":"+'DataBase-XI'!A290","v":226},{"$f":"IF(ISBLANK(A330),\"\",VLOOKUP(A330,Data2,2))","v":"XI IPS-3"},1,{"$f":"IF(ISBLANK(A330),\"\",VLOOKUP(A330,Data2,3))","v":"ABDUL WAHID"},{"$f":"IF(ISBLANK(A330),\"\",VLOOKUP(A330,Data2,5))","v":"9965299861"},{"$f":"IF(ISBLANK(A330),\"\",VLOOKUP(A330,Data2,6))","v":"L"}]
[{"$f":"+A330+1","v":227},"XI IPS-3",2,0,0,0]
[228,"XI IPS-3",3,0,0,0]
[229,"XI IPS-3",4,0,0,0]
[230,"XI IPS-3",5,0,0,0]
[231,"XI IPS-3",6,0,0,0]
[232,"XI IPS-3",7,0,0,0]
[233,"XI IPS-3",8,0,0,0]
[234,"XI IPS-3",9,0,0,0]
[235,"XI IPS-3",10,0,0,0]
[236,"XI IPS-3",11,0,0,0]
[237,"XI IPS-3",12,0,0,0]
[238,"XI IPS-3",13,0,0,0]
[239,"XI IPS-3",14,0,0,0]
[240,"XI IPS-3",15,0,0,0]
[241,"XI IPS-3",16,0,0,0]
[242,"XI IPS-3",17,0,0,0]
[243,"XI IPS-3",18,0,0,0]
[244,"XI IPS-3",19,0,0,0]
[245,"XI IPS-3",20,0,0,0]
[246,"XI IPS-3",21,0,0,0]
[247,"XI IPS-3",22,0,0,0]
[248,"XI IPS-3",23,0,0,0]
[249,"XI IPS-3",24,0,0,0]
[250,"XI IPS-3",25,0,0,0]
[251,"XI IPS-3",26,0,0,0]
[252,"XI IPS-3",27,0,0,0]
[253,"XI IPS-3",28,0,0,0]
[254,"XI IPS-3",29,0,0,0]
[255,"XI IPS-3",30,0,0,0]
[256,"XI IPS-3",31,0,0,0]
[257,"XI IPS-3",32,0,0,0]
[258,"XI IPS-3",33,0,0,0]
[259,"XI IPS-3",34,0,0,0]
[260,"XI IPS-3",35,0,0,0]
[{"$f":"+A364+1","v":261},"XI IPS-3",36,0,0,0]
[{"$f":"+A365+1","v":262},"XI IPS-3",37,0,0,0]
[{"$f":"+A366+1","v":263},"XI IPS-3",38,0,0,0]
[{"$f":"+A367+1","v":264},"XI IPS-3",39,0,0,0]
[{"$f":"+A368+1","v":265},"XI IPS-3",40,0,0,0]
[null,null,null,"Mengetahui",null,null,null,null,null,null,null,null,{"$f":"CONCATENATE(MENU!$D$13,\" ,   \",R370)","v":"Cilegon ,   24 Juli 2013"},null,null,null,null,{"$f":"TEXT(NOW(),\"dd mmmm yyyy\")","v":"24 Juli 2013"}]
[null,null,null,"Waka Kurikulum",null,null,null,null,null,null,null,null,"Guru Bidang Study"]
[]
[]
[null,null,null,"................................",null,null,null,null,null,null,null,null,"................................"]
[null,null,null,"NIP: ",null,null,"Mengetahui",null,null,null,null,null,"NIP: "]
[null,null,null,null,null,null,"Kepala Sekolah"]
[]
[]
[null,null,null,null,null,null,{"$f":"+[1]MENU!$C$16","v":"Asep Mansur,S.Pd"}]
[null,null,null,null,null,null,{"$f":"+[1]MENU!$C$17","v":"NIP: 19620101 198512 1 004"}]

{"sheet":"Absen-XII","index":12,"n_rows":388,"n_cols":22,"rows_kept":388,"cut":false,"hidden":false,"merged":[[386,20,386,30],[387,20,387,30],[336,2,337,2],[336,3,337,3],[336,4,337,4],[336,5,337,5],[336,6,336,31],[338,2,338,31],[334,2,334,31],[252,21,252,31],[253,21,253,31],[265,2,265,31],[266,2,266,31],[267,2,267,31],[269,2,270,2],[269,3,270,3],[269,4,270,4],[269,5,270,5],[269,6,269,31],[271,2,271,31],[319,20,319,30],[320,20,320,30],[332,2,332,31],[333,2,333,31],[204,2,204,31],[137,2,137,31],[186,20,186,30],[187,20,187,30],[198,2,198,31],[199,2,199,31],[200,2,200,31],[202,2,203,2],[202,3,203,3],[202,4,203,4],[202,5,203,5],[202,6,202,31],[122,20,122,30],[123,20,123,30],[131,2,131,31],[132,2,132,31],[133,2,133,31],[135,2,136,2],[135,3,136,3],[135,4,136,4],[135,5,136,5],[135,6,135,31],[74,2,74,31],[6,2,6,31],[56,20,56,30],[57,20,57,30],[68,2,68,31],[69,2,69,31],[70,2,70,31],[72,2,73,2],[72,3,73,3],[72,4,73,4],[72,5,73,5],[72,6,72,31],[0,0,5,0],[0,2,0,31],[1,2,1,31],[2,2,2,31],[4,2,5,2],[4,3,5,3],[4,4,5,4],[4,5,5,5],[4,6,4,31]]}
["NO URUT DATABASE",null,"DAFTAR HADIR SISWA"]
[null,null,{"$f":"+MENU!$D$8","v":"SMA NEGERI 5 CILEGON"}]
[null,null,{"$f":"CONCATENATE(MENU!$C$7,\" \",MENU!$D$7)","v":"TAHUN AJARAN 2013-2014"}]
[null,null,"KELAS",null,{"$f":"IF(ISBLANK(A8),\"\",VLOOKUP(A8,Data3,2))","v":"XII IPA-1"}]
[null,null,"NO","NIS","NAMA","L/P","Tanggal"]
[]
[]
[{"$f":"+'DataBase-XI'!A5","v":1},{"$f":"IF(ISBLANK(A8),\"\",VLOOKUP(A8,Data3,2))","v":"XII IPA-1"},1,{"$f":"IF(ISBLANK(A8),\"\",VLOOKUP(A8,Data3,5))","v":"9960473779"},{"$f":"IF(ISBLANK(A8),\"\",VLOOKUP(A8,Data3,3))","v":"ADE ROSIHA"},{"$f":"IF(ISBLANK(A8),\"\",VLOOKUP(A8,Data3,6))","v":"P"}]
[2,"XII IPA-1",2,0,0,0]
[3,"XII IPA-1",3,0,0,0]
[4,"XII IPA-1",4,0,0,0]
[5,"XII IPA-1",5,0,0,0]
[6,"XII IPA-1",6,0,0,0]
[7,"XII IPA-1",7,0,0,0]
[8,"XII IPA-1",8,0,0,0]
[9,"XII IPA-1",9,0,0,0]
[10,"XII IPA-1",10,0,0,0]
[11,"XII IPA-1",11,0,0,0]
[12,"XII IPA-1",12,0,0,0]
[13,"XII IPA-1",13,0,0,0]
[14,"XII IPA-1",14,0,0,0]
[15,"XII IPA-1",15,0,0,0]
[16,"XII IPA-1",16,0,0,0]
[17,"XII IPA-1",17,0,0,0]
[18,"XII IPA-1",18,0,0,0]
[19,"XII IPA-1",19,0,0,0]
[20,"XII IPA-1",20,0,0,0]
[21,"XII IPA-1",21,0,0,0]
[22,"XII IPA-1",22,0,0,0]
[23,"XII IPA-1",23,0,0,0]
[24,"XII IPA-1",24,0,0,0]
[25,"XII IPA-1",25,0,0,0]
[26,"XII IPA-1",26,0,0,0]
[27,"XII IPA-1",27,0,0,0]
[28,"XII IPA-1",28,0,0,0]
[29,"XII IPA-1",29,0,0,0]
[30,"XII IPA-1",30,0,0,0]
[31,"XII IPA-1",31,0,0,0]
[32,"XII IPA-1",32,0,0,0]
[33,"XII IPA-1",33,0,0,0]
[34,"XII IPA-1",34,0,0,0]
[35,"XII IPA-1",35,0,0,0]
[36,"XII IPA-1",36,0,0,0]
[37,"XII IPA-1",37,0,0,0]
[38,"XII IPA-1",38,0,0,0]
[39,"XII IPA-1",39,0,0,0]
[40,"XII IPA-1",40]
[]
[{"$f":"MAX(A8:A47)","v":40},null,null,null,"Jumlah Laki-laki",{"$f":"COUNTIF(F8:F47,\"L\")","v":0},null,null,null,null,null,null,null,null,null,null,null,null,null,null,"Cilegon,…………………………….20"]
[null,null,null,null,"Jumlah Perempuan",{"$f":"COUNTIF(F8:F47,\"P\")","v":1},null,null,null,null,null,null,null,null,null,null,null,null,null,null,"Guru Bidang Studi"]
[null,null,null,null,"Jumlah Total",{"$f":"SUM(F49:F50)","v":1}]
[]
[]
[]
[]
[]
[null,null,null,null,null,null,null,null,null,null,null,null,null,null,null,null,null,null,null,null,"(……………………...……….)"]
[null,null,null,null,null,null,null,null,null,null,null,null,null,null,null,null,null,null,null,null,"NIP:……………………………………."]
[]
[]
[]
[]
[]
[]
[]
[]
[]
[]
[null,null,"DAFTAR HADIR SISWA"]
[null,null,{"$f":"+MENU!$D$8","v":"SMA NEGERI 5 CILEGON"}]
[null,null,{"$f":"CONCATENATE(MENU!$C$7,\" \",MENU!$D$7)","v":"TAHUN AJARAN 2013-2014"}]
[null,null,"KELAS",null,{"$f":"IF(ISBLANK(A76),\"\",VLOOKUP(A76,Data3,2))","v":"XII IPA-2"}]
[null,null,"NO","NIS","NAMA","L/P","Tanggal"]
[]
[]
[{"$f":"+'DataBase-XI'!A62","v":46},{"$f":"IF(ISBLANK(A76),\"\",VLOOKUP(A76,Data3,2))","v":"XII IPA-2"},1,{"$f":"IF(ISBLANK(A76),\"\",VLOOKUP(A76,Data3,5))","v":"9960470745"},{"$f":"IF(ISBLANK(A76),\"\",VLOOKUP(A76,Data3,3))","v":"ALLISYAARA NOERHUZA"},{"$f":"IF(ISBLANK(A76),\"\",VLOOKUP(A76,Data3,6))","v":"P"}]
[{"$f":"+A76+1","v":47},"XII IPA-2",2,0,0,0]
[48,"XII IPA-2",3,0,0,0]
[49,"XII IPA-2",4,0,0,0]
[50,"XII IPA-2",5,0,0,0]
[51,"XII IPA-2",6,0,0,0]
[52,"XII IPA-2",7,0,0,0]
[53,"XII IPA-2",8,0,0,0]
[54,"XII IPA-2",9,0,0,0]
[55,"XII IPA-2",10,0,0,0]
[56,"XII IPA-2",11,0,0,0]
[57,"XII IPA-2",12,0,0,0]
[58,"XII IPA-2",13,0,0,0]
[59,"XII IPA-2",14,0,0,0]
[60,"XII IPA-2",15,0,0,0]
[61,"XII IPA-2",16,0,0,0]
[62,"XII IPA-2",17,0,0,0]
[63,"XII IPA-2",18,0,0,0]
[64,"XII IPA-2",19,0,0,0]
[65,"XII IPA-2",20,0,0,0]
[66,"XII IPA-2",21,0,0,0]
[67,"XII IPA-2",22,0,0,0]
[68,"XII IPA-2",23,0,0,0]
[69,"XII IPA-2",24,0,0,0]
[70,"XII IPA-2",25,0,0,0]
[71,"XII IPA-2",26,0,0,0]
[72,"XII IPA-2",27,0,0,0]
[73,"XII IPA-2",28,0,0,0]
[74,"XII IPA-2",29,0,0,0]
[75,"XII IPA-2",30,0,0,0]
[76,"XII IPA-2",31,0,0,0]
[77,"XII IPA-2",32,0,0,0]
[78,"XII IPA-2",33,0,0,0]
[79,"XII IPA-2",34,0,0,0]
[80,"XII IPA-2",35,0,0,0]
[81,"XII IPA-2",36,0,0,0]
[82,"XII IPA-2",37,0,0,0]
[83,"XII IPA-2",38,0,0,0]
[84,"XII IPA-2",39,0,0,0]
[85,"XII IPA-2",40,0,0,0]
[]
[{"$f":"MAX(A76:A113)","v":83},null,null,null,"Jumlah Laki-laki",{"$f":"COUNTIF(F76:F115,\"L\")","v":0},null,null,null,null,null,null,null,null,null,null,null,null,null,null,"Cilegon,…………………………….20"]
[null,null,null,null,"Jumlah Perempuan",{"$f":"COUNTIF(F76:F115,\"P\")","v":1},null,null,null,null,null,null,null,null,null,null,null,null,null,null,"Guru Bidang Studi"]
[null,null,null,null,"Jumlah Total",{"$f":"SUM(F117:F118)","v":1}]
[]
[]
[]
[null,null,null,null,null,null,null,null,null,null,null,null,null,null,null,null,null,null,null,null,"(……………………...……….)"]
[null,null,null,null,null,null,null,null,null,null,null,null,null,null,null,null,null,null,null,null,"NIP:……………………………………."]
[]
[]
[]
[]
[]
[]
[]
[null,null,"DAFTAR HADIR SISWA"]
[null,null,{"$f":"+MENU!$D$8","v":"SMA NEGERI 5 CILEGON"}]
[null,null,{"$f":"CONCATENATE(MENU!$C$7,\" \",MENU!$D$7)","v":"TAHUN AJARAN 2013-2014"}]
[null,null,"KELAS",null,{"$f":"IF(ISBLANK(A139),\"\",VLOOKUP(A139,Data3,2))","v":"XII IPA-3"}]
[null,null,"NO","NIS","NAMA","L/P","Tanggal"]
[]
[]
[{"$f":"+'DataBase-XI'!A119","v":91},{"$f":"IF(ISBLANK(A139),\"\",VLOOKUP(A139,Data3,2))","v":"XII IPA-3"},1,{"$f":"IF(ISBLANK(A139),\"\",VLOOKUP(A139,Data3,5))","v":"9965293057"},{"$f":"IF(ISBLANK(A139),\"\",VLOOKUP(A139,Data3,3))","v":"ADI FIRMANSYAH"},{"$f":"IF(ISBLANK(A139),\"\",VLOOKUP(A139,Data3,6))","v":"L"}]
[{"$f":"+A139+1","v":92},"XII IPA-3",2,0,0,0]
[93,"XII IPA-3",3,0,0,0]
[94,"XII IPA-3",4,0,0,0]
[95,"XII IPA-3",5,0,0,0]
[96,"XII IPA-3",6,0,0,0]
[97,"XII IPA-3",7,0,0,0]
[98,"XII IPA-3",8,0,0,0]
[99,"XII IPA-3",9,0,0,0]
[100,"XII IPA-3",10,0,0,0]
[101,"XII IPA-3",11,0,0,0]
[102,"XII IPA-3",12,0,0,0]
[103,"XII IPA-3",13,0,0,0]
[104,"XII IPA-3",14,0,0,0]
[105,"XII IPA-3",15,0,0,0]
[106,"XII IPA-3",16,0,0,0]
[107,"XII IPA-3",17,0,0,0]
[108,"XII IPA-3",18,0,0,0]
[109,"XII IPA-3",19,0,0,0]
[110,"XII IPA-3",20,0,0,0]
[111,"XII IPA-3",21,0,0,0]
[112,"XII IPA-3",22,0,0,0]
[113,"XII IPA-3",23,0,0,0]
[114,"XII IPA-3",24,0,0,0]
[115,"XII IPA-3",25,0,0,0]
[116,"XII IPA-3",26,0,0,0]
[117,"XII IPA-3",27,0,0,0]
[118,"XII IPA-3",28,0,0,0]
[119,"XII IPA-3",29,0,0,0]
[120,"XII IPA-3",30,0,0,0]
[121,"XII IPA-3",31,0,0,0]
[122,"XII IPA-3",32,0,0,0]
[123,"XII IPA-3",33,0,0,0]
[124,"XII IPA-3",34,0,0,0]
[125,"XII IPA-3",35,0,0,0]
[{"$f":"+A173+1","v":126},"XII IPA-3",36,0,0,0]
[{"$f":"+A174+1","v":127},"XII IPA-3",37,0,0,0]
[{"$f":"+A175+1","v":128},"XII IPA-3",38,0,0,0]
[{"$f":"+A176+1","v":129},"XII IPA-3",39,0,0,0]
[{"$f":"+A177+1","v":130},"XII IPA-3",40,0,0,0]
[]
[{"$f":"MAX(A139:A177)","v":129},null,null,null,"Jumlah Laki-laki",{"$f":"COUNTIF(F139:F178,\"L\")","v":1},null,null,null,null,null,null,null,null,null,null,null,null,null,null,"Cilegon,…………………………….20"]
[null,null,null,null,"Jumlah Perempuan",{"$f":"COUNTIF(F139:F178,\"P\")","v":0},null,null,null,null,null,null,null,null,null,null,null,null,null,null,"Guru Bidang Studi"]
[null,null,null,null,"Jumlah Total",{"$f":"SUM(F180:F181)","v":1}]
[]
[]
[]
[]
[null,null,null,null,null,null,null,null,null,null,null,null,null,null,null,null,null,null,null,null,"(……………………...……….)"]
[null,null,null,null,null,null,null,null,null,null,null,null,null,null,null,null,null,null,null,null,"NIP:……………………………………."]
[]
[]
[]
[]
[]
[]
[]
[]
[]
[]
[null,null,"DAFTAR HADIR SISWA"]
[null,null,{"$f":"+MENU!$D$8","v":"SMA NEGERI 5 CILEGON"}]
[null,null,{"$f":"CONCATENATE(MENU!$C$7,\" \",MENU!$D$7)","v":"TAHUN AJARAN 2013-2014"}]
[null,null,"KELAS",null,{"$f":"IF(ISBLANK(A206),\"\",VLOOKUP(A206,Data3,2))","v":"XII IPS-1"}]
[null,null,"NO","NIS","NAMA","L/P","Tanggal"]
[]
[]
[{"$f":"+'DataBase-XI'!A176","v":136},{"$f":"IF(ISBLANK(A206),\"\",VLOOKUP(A206,Data3,2))","v":"XII IPS-1"},1,{"$f":"IF(ISBLANK(A206),\"\",VLOOKUP(A206,Data3,5))","v":"9962208731"},{"$f":"IF(ISBLANK(A206),\"\",VLOOKUP(A206,Data3,3))","v":"AGI PURNAMA BELRA"},{"$f":"IF(ISBLANK(A206),\"\",VLOOKUP(A206,Data3,6))","v":"L"}]
[{"$f":"+A206+1","v":137},"XII IPS-1",2,0,0,0]
[138,"XII IPS-1",3,0,0,0]
[139,"XII IPS-1",4,0,0,0]
[140,"XII IPS-1",5,0,0,0]
[141,"XII IPS-1",6,0,0,0]
[142,"XII IPS-1",7,0,0,0]
[143,"XII IPS-1",8,0,0,0]
[144,"XII IPS-1",9,0,0,0]
[145,"XII IPS-1",10,0,0,0]
[146,"XII IPS-1",11,0,0,0]
[147,"XII IPS-1",12,0,0,0]
[148,"XII IPS-1",13,0,0,0]
[149,"XII IPS-1",14,0,0,0]
[150,"XII IPS-1",15,0,0,0]
[151,"XII IPS-1",16,0,0,0]
[152,"XII IPS-1",17,0,0,0]
[153,"XII IPS-1",18,0,0,0]
[154,"XII IPS-1",19,0,0,0]
[155,"XII IPS-1",20,0,0,0]
[156,"XII IPS-1",21,0,0,0]
[157,"XII IPS-1",22,0,0,0]
[158,"XII IPS-1",23,0,0,0]
[159,"XII IPS-1",24,0,0,0]
[160,"XII IPS-1",25,0,0,0]
[161,"XII IPS-1",26,0,0,0]
[162,"XII IPS-1",27,0,0,0]
[163,"XII IPS-1",28,0,0,0]
[164,"XII IPS-1",29,0,0,0]
[165,"XII IPS-1",30,0,0,0]
[166,"XII IPS-1",31,0,0,0]
[167,"XII IPS-1",32,0,0,0]
[168,"XII IPS-1",33,0,0,0]
[169,"XII IPS-1",34,0,0,0]
[170,"XII IPS-1",35,0,0,0]
[{"$f":"+A240+1","v":171},"XII IPS-1",36,0,0,0]
[{"$f":"+A241+1","v":172},"XII IPS-1",37,0,0,0]
[{"$f":"+A242+1","v":173},"XII IPS-1",38,0,0,0]
[{"$f":"+A243+1","v":174},"XII IPS-1",39,0,0,0]
[{"$f":"+A244+1","v":175},"XII IPS-1",40,0,0,0]
[]
[{"$f":"MAX(A206:A244)","v":174},null,null,null,"Jumlah Laki-laki",{"$f":"COUNTIF(F206:F245,\"L\")","v":1},null,null,null,null,null,null,null,null,null,null,null,null,null,null,null,"Cilegon,…………………………….20"]
[null,null,null,null,"Jumlah Perempuan",{"$f":"COUNTIF(F206:F245,\"P\")","v":0},null,null,null,null,null,null,null,null,null,null,null,null,null,null,null,"Guru Bidang Studi"]
[null,null,null,null,"Jumlah Total",{"$f":"SUM(F247:F248)","v":1}]
[]
[]
[]
[null,null,null,null,null,null,null,null,null,null,null,null,null,null,null,null,null,null,null,null,null,"(……………………...……….)"]
[null,null,null,null,null,null,null,null,null,null,null,null,null,null,null,null,null,null,null,null,null,"NIP:……………………………………."]
[]
[]
[]
[]
[]
[]
[]
[]
[]
[]
[]
[null,null,"DAFTAR HADIR SISWA"]
[null,null,{"$f":"+MENU!$D$8","v":"SMA NEGERI 5 CILEGON"}]
[null,null,{"$f":"CONCATENATE(MENU!$C$7,\" \",MENU!$D$7)","v":"TAHUN AJARAN 2013-2014"}]
[null,null,"KELAS",null,{"$f":"IF(ISBLANK(A273),\"\",VLOOKUP(A273,Data3,2))","v":"XII IPS-2"}]
[null,null,"NO","NIS","NAMA","L/P","Tanggal"]
[]
[]
[{"$f":"+'DataBase-XI'!A233","v":181},{"$f":"IF(ISBLANK(A273),\"\",VLOOKUP(A273,Data3,2))","v":"XII IPS-2"},1,{"$f":"IF(ISBLANK(A273),\"\",VLOOKUP(A273,Data3,5))","v":"9960471837"},{"$f":"IF(ISBLANK(A273),\"\",VLOOKUP(A273,Data3,3))","v":"AGUS GUNAWAN"},{"$f":"IF(ISBLANK(A273),\"\",VLOOKUP(A273,Data3,6))","v":"L"}]
[{"$f":"+A273+1","v":182},"XII IPS-2",2,0,0,0]
[183,"XII IPS-2",3,0,0,0]
[184,"XII IPS-2",4,0,0,0]
[185,"XII IPS-2",5,0,0,0]
[186,"XII IPS-2",6,0,0,0]
[187,"XII IPS-2",7,0,0,0]
[188,"XII IPS-2",8,0,0,0]
[189,"XII IPS-2",9,0,0,0]
[190,"XII IPS-2",10,0,0,0]
[191,"XII IPS-2",11,0,0,0]
[192,"XII IPS-2",12,0,0,0]
[193,"XII IPS-2",13,0,0,0]
[194,"XII IPS-2",14,0,0,0]
[195,"XII IPS-2",15,0,0,0]
[196,"XII IPS-2",16,0,0,0]
[197,"XII IPS-2",17,0,0,0]
[198,"XII IPS-2",18,0,0,0]
[199,"XII IPS-2",19,0,0,0]
[200,"XII IPS-2",20,0,0,0]
[201,"XII IPS-2",21,0,0,0]
[202,"XII IPS-2",22,0,0,0]
[203,"XII IPS-2",23,0,0,0]
[204,"XII IPS-2",24,0,0,0]
[205,"XII IPS-2",25,0,0,0]
[206,"XII IPS-2",26,0,0,0]
[207,"XII IPS-2",27,0,0,0]
[208,"XII IPS-2",28,0,0,0]
[209,"XII IPS-2",29,0,0,0]
[210,"XII IPS-2",30,0,0,0]
[211,"XII IPS-2",31,0,0,0]
[212,"XII IPS-2",32,0,0,0]
[213,"XII IPS-2",33,0,0,0]
[214,"XII IPS-2",34,0,0,0]
[215,"XII IPS-2",35,0,0,0]
[{"$f":"+A307+1","v":216},"XII IPS-2",36,0,0,0]
[{"$f":"+A308+1","v":217},"XII IPS-2",37,0,0,0]
[{"$f":"+A309+1","v":218},"XII IPS-2",38,0,0,0]
[{"$f":"+A310+1","v":219},"XII IPS-2",39,0,0,0]
[{"$f":"+A311+1","v":220},"XII IPS-2",40,0,0,0]
[]
[{"$f":"MAX(A273:A312)","v":220},null,null,null,"Jumlah Laki-laki",{"$f":"COUNTIF(F272:F312,\"L\")","v":1},null,null,null,null,null,null,null,null,null,null,null,null,null,null,"Cilegon,…………………………….20"]
[null,null,null,null,"Jumlah Perempuan",{"$f":"COUNTIF(F272:F312,\"P\")","v":0},null,null,null,null,null,null,null,null,null,null,null,null,null,null,"Guru Bidang Studi"]
[null,null,null,null,"Jumlah Total",{"$f":"SUM(F314:F315)","v":1}]
[]
[]
[]
[null,null,null,null,null,null,null,null,null,null,null,null,null,null,null,null,null,null,null,null,"(……………………...……….)"]
[null,null,null,null,null,null,null,null,null,null,null,null,null,null,null,null,null,null,null,null,"NIP:……………………………………."]
[]
[]
[]
[]
[]
[]
[]
[]
[]
[]
[]
[null,null,"DAFTAR HADIR SISWA"]
[null,null,{"$f":"+MENU!$D$8","v":"SMA NEGERI 5 CILEGON"}]
[null,null,{"$f":"CONCATENATE(MENU!$C$7,\" \",MENU!$D$7)","v":"TAHUN AJARAN 2013-2014"}]
[null,null,"KELAS",null,{"$f":"IF(ISBLANK(A340),\"\",VLOOKUP(A340,Data3,2))","v":"XII IPS-3"}]
[null,null,"NO","NIS","NAMA","L/P","Tanggal"]
[]
[]
[{"$f":"+'DataBase-XI'!A290","v":226},{"$f":"IF(ISBLANK(A340),\"\",VLOOKUP(A340,Data3,2))","v":"XII IPS-3"},1,{"$f":"IF(ISBLANK(A340),\"\",VLOOKUP(A340,Data3,5))","v":"9960472157"},{"$f":"IF(ISBLANK(A340),\"\",VLOOKUP(A340,Data3,3))","v":"ANUGRAH PRATAMA"},{"$f":"IF(ISBLANK(A340),\"\",VLOOKUP(A340,Data3,6))","v":"L"}]
[{"$f":"+A340+1","v":227},"XII IPS-3",2,0,0,0]
[228,"XII IPS-3",3,0,0,0]
[229,"XII IPS-3",4,0,0,0]
[230,"XII IPS-3",5,0,0,0]
[231,"XII IPS-3",6,0,0,0]
[232,"XII IPS-3",7,0,0,0]
[233,"XII IPS-3",8,0,0,0]
[234,"XII IPS-3",9,0,0,0]
[235,"XII IPS-3",10,0,0,0]
[236,"XII IPS-3",11,0,0,0]
[237,"XII IPS-3",12,0,0,0]
[238,"XII IPS-3",13,0,0,0]
[239,"XII IPS-3",14,0,0,0]
[240,"XII IPS-3",15,0,0,0]
[241,"XII IPS-3",16,0,0,0]
[242,"XII IPS-3",17,0,0,0]
[243,"XII IPS-3",18,0,0,0]
[244,"XII IPS-3",19,0,0,0]
[245,"XII IPS-3",20,0,0,0]
[246,"XII IPS-3",21,0,0,0]
[247,"XII IPS-3",22,0,0,0]
[248,"XII IPS-3",23,0,0,0]
[249,"XII IPS-3",24,0,0,0]
[250,"XII IPS-3",25,0,0,0]
[251,"XII IPS-3",26,0,0,0]
[252,"XII IPS-3",27,0,0,0]
[253,"XII IPS-3",28,0,0,0]
[254,"XII IPS-3",29,0,0,0]
[255,"XII IPS-3",30,0,0,0]
[256,"XII IPS-3",31,0,0,0]
[257,"XII IPS-3",32,0,0,0]
[258,"XII IPS-3",33,0,0,0]
[259,"XII IPS-3",34,0,0,0]
[260,"XII IPS-3",35,0,0,0]
[{"$f":"+A374+1","v":261},"XII IPS-3",36,0,0,0]
[{"$f":"+A375+1","v":262},"XII IPS-3",37,0,0,0]
[{"$f":"+A376+1","v":263},"XII IPS-3",38,0,0,0]
[{"$f":"+A377+1","v":264},"XII IPS-3",39,0,0,0]
[{"$f":"+A378+1","v":265},"XII IPS-3",40,0,0,0]
[]
[null,null,null,null,"Jumlah Laki-laki",{"$f":"COUNTIF(F339:F379,\"L\")","v":1},null,null,null,null,null,null,null,null,null,null,null,null,null,null,"Cilegon,…………………………….20"]
[null,null,null,null,"Jumlah Perempuan",{"$f":"COUNTIF(F339:F379,\"P\")","v":0},null,null,null,null,null,null,null,null,null,null,null,null,null,null,"Guru Bidang Studi"]
[null,null,null,null,"Jumlah Total",{"$f":"SUM(F381:F382)","v":1}]
[]
[]
[]
[null,null,null,null,null,null,null,null,null,null,null,null,null,null,null,null,null,null,null,null,"(……………………...……….)"]
[null,null,null,null,null,null,null,null,null,null,null,null,null,null,null,null,null,null,null,null,"NIP:……………………………………."]

{"sheet":"Raport-XII","index":13,"n_rows":349,"n_cols":10,"rows_kept":349,"cut":false,"hidden":false,"merged":[[304,2,304,9],[244,2,244,9],[298,2,298,9],[299,2,299,9],[300,2,300,9],[302,2,303,2],[302,3,303,3],[302,4,303,4],[302,5,303,5],[302,6,302,8],[302,9,303,9],[184,2,184,9],[238,2,238,9],[239,2,239,9],[240,2,240,9],[242,2,243,2],[242,3,243,3],[242,4,243,4],[242,5,243,5],[242,6,242,8],[242,9,243,9],[124,2,124,9],[178,2,178,9],[179,2,179,9],[180,2,180,9],[182,2,183,2],[182,3,183,3],[182,4,183,4],[182,5,183,5],[182,6,182,8],[182,9,183,9],[66,2,66,9],[118,2,118,9],[119,2,119,9],[120,2,120,9],[122,2,123,2],[122,3,123,3],[122,4,123,4],[122,5,123,5],[122,6,122,8],[122,9,123,9],[6,2,6,9],[60,2,60,9],[61,2,61,9],[62,2,62,9],[64,2,65,2],[64,3,65,3],[64,4,65,4],[64,5,65,5],[64,6,64,8],[64,9,65,9],[0,0,5,0],[0,2,0,9],[1,2,1,9],[2,2,2,9],[4,2,5,2],[4,3,5,3],[4,4,5,4],[4,5,5,5],[4,6,4,8],[4,9,5,9]]}
["NO URUT DATABASE",null,"DAFTAR NILAI SISWA"]
[null,null,{"$f":"+MENU!$D$8","v":"SMA NEGERI 5 CILEGON"}]
[null,null,{"$f":"CONCATENATE(MENU!$C$7,\" \",MENU!$D$7)","v":"TAHUN AJARAN 2013-2014"}]
[null,null,"KELAS",null,{"$f":"IF(ISBLANK(A8),\"\",VLOOKUP(A8,Data3,2))","v":"XII IPA-1"}]
[null,null,"NO","NIS","NAMA","L/P","NILAI RAPORT",null,null,"KET"]
[null,null,null,null,null,null,"Kognitif","Afektif","Psikomotor"]
[]
[{"$f":"+'DataBase-XI'!A5","v":1},{"$f":"IF(ISBLANK(A8),\"\",VLOOKUP(A8,Data3,2))","v":"XII IPA-1"},1,{"$f":"IF(ISBLANK(A8),\"\",VLOOKUP(A8,Data3,5))","v":"9960473779"},{"$f":"IF(ISBLANK(A8),\"\",VLOOKUP(A8,Data3,3))","v":"ADE ROSIHA"},{"$f":"IF(ISBLANK(A8),\"\",VLOOKUP(A8,Data3,6))","v":"P"}]
[2,"XII IPA-1",2,0,0,0]
[3,"XII IPA-1",3,0,0,0]
[4,"XII IPA-1",4,0,0,0]
[5,"XII IPA-1",5,0,0,0]
[6,"XII IPA-1",6,0,0,0]
[7,"XII IPA-1",7,0,0,0]
[8,"XII IPA-1",8,0,0,0]
[9,"XII IPA-1",9,0,0,0]
[10,"XII IPA-1",10,0,0,0]
[11,"XII IPA-1",11,0,0,0]
[12,"XII IPA-1",12,0,0,0]
[13,"XII IPA-1",13,0,0,0]
[14,"XII IPA-1",14,0,0,0]
[15,"XII IPA-1",15,0,0,0]
[16,"XII IPA-1",16,0,0,0]
[17,"XII IPA-1",17,0,0,0]
[18,"XII IPA-1",18,0,0,0]
[19,"XII IPA-1",19,0,0,0]
[20,"XII IPA-1",20,0,0,0]
[21,"XII IPA-1",21,0,0,0]
[22,"XII IPA-1",22,0,0,0]
[23,"XII IPA-1",23,0,0,0]
[24,"XII IPA-1",24,0,0,0]
[25,"XII IPA-1",25,0,0,0]
[26,"XII IPA-1",26,0,0,0]
[27,"XII IPA-1",27,0,0,0]
[28,"XII IPA-1",28,0,0,0]
[29,"XII IPA-1",29,0,0,0]
[30,"XII IPA-1",30,0,0,0]
[31,"XII IPA-1",31,0,0,0]
[32,"XII IPA-1",32,0,0,0]
[33,"XII IPA-1",33,0,0,0]
[34,"XII IPA-1",34,0,0,0]
[35,"XII IPA-1",35,0,0,0]
[36,"XII IPA-1",36,0,0,0]
[37,"XII IPA-1",37,0,0,0]
[38,"XII IPA-1",38,0,0,0]
[39,"XII IPA-1",39,0,0,0]
[40,"XII IPA-1",40]
[]
[{"$f":"MAX(A8:A47)","v":40},null,null,null,"Jumlah Laki-laki",{"$f":"COUNTIF(F8:F47,\"L\")","v":0}]
[null,null,null,null,"Jumlah Perempuan",{"$f":"COUNTIF(F8:F47,\"P\")","v":1}]
[null,null,null,null,"Jumlah Total",{"$f":"SUM(F49:F50)","v":1}]
[]
[]
[]
[]
[]
[]
[]
[]
[]
[null,null,"DAFTAR NILAI SISWA"]
[null,null,{"$f":"+MENU!$D$8","v":"SMA NEGERI 5 CILEGON"}]
[null,null,{"$f":"CONCATENATE(MENU!$C$7,\" \",MENU!$D$7)","v":"TAHUN AJARAN 2013-2014"}]
[null,null,"KELAS",null,{"$f":"IF(ISBLANK(A68),\"\",VLOOKUP(A68,Data3,2))","v":"XII IPA-2"}]
[null,null,"NO","NIS","NAMA","L/P","NILAI RAPORT",null,null,"KET"]
[null,null,null,null,null,null,"Kognitif","Afektif","Psikomotor"]
[]
[{"$f":"+'DataBase-XI'!A62","v":46},{"$f":"IF(ISBLANK(A68),\"\",VLOOKUP(A68,Data3,2))","v":"XII IPA-2"},1,{"$f":"IF(ISBLANK(A68),\"\",VLOOKUP(A68,Data3,5))","v":"9960470745"},{"$f":"IF(ISBLANK(A68),\"\",VLOOKUP(A68,Data3,3))","v":"ALLISYAARA NOERHUZA"},{"$f":"IF(ISBLANK(A68),\"\",VLOOKUP(A68,Data3,6))","v":"P"}]
[{"$f":"+A68+1","v":47},"XII IPA-2",2,0,0,0]
[48,"XII IPA-2",3,0,0,0]
[49,"XII IPA-2",4,0,0,0]
[50,"XII IPA-2",5,0,0,0]
[51,"XII IPA-2",6,0,0,0]
[52,"XII IPA-2",7,0,0,0]
[53,"XII IPA-2",8,0,0,0]
[54,"XII IPA-2",9,0,0,0]
[55,"XII IPA-2",10,0,0,0]
[56,"XII IPA-2",11,0,0,0]
[57,"XII IPA-2",12,0,0,0]
[58,"XII IPA-2",13,0,0,0]
[59,"XII IPA-2",14,0,0,0]
[60,"XII IPA-2",15,0,0,0]
[61,"XII IPA-2",16,0,0,0]
[62,"XII IPA-2",17,0,0,0]
[63,"XII IPA-2",18,0,0,0]
[64,"XII IPA-2",19,0,0,0]
[65,"XII IPA-2",20,0,0,0]
[66,"XII IPA-2",21,0,0,0]
[67,"XII IPA-2",22,0,0,0]
[68,"XII IPA-2",23,0,0,0]
[69,"XII IPA-2",24,0,0,0]
[70,"XII IPA-2",25,0,0,0]
[71,"XII IPA-2",26,0,0,0]
[72,"XII IPA-2",27,0,0,0]
[73,"XII IPA-2",28,0,0,0]
[74,"XII IPA-2",29,0,0,0]
[75,"XII IPA-2",30,0,0,0]
[76,"XII IPA-2",31,0,0,0]
[77,"XII IPA-2",32,0,0,0]
[78,"XII IPA-2",33,0,0,0]
[79,"XII IPA-2",34,0,0,0]
[80,"XII IPA-2",35,0,0,0]
[81,"XII IPA-2",36,0,0,0]
[82,"XII IPA-2",37,0,0,0]
[83,"XII IPA-2",38,0,0,0]
[84,"XII IPA-2",39,0,0,0]
[85,"XII IPA-2",40,0,0,0]
[]
[{"$f":"MAX(A68:A105)","v":83},null,null,null,"Jumlah Laki-laki",{"$f":"COUNTIF(F68:F107,\"L\")","v":0}]
[null,null,null,null,"Jumlah Perempuan",{"$f":"COUNTIF(F68:F107,\"P\")","v":1}]
[null,null,null,null,"Jumlah Total",{"$f":"SUM(F109:F110)","v":1}]
[]
[]
[]
[]
[]
[]
[]
[null,null,"DAFTAR NILAI SISWA"]
[null,null,{"$f":"+MENU!$D$8","v":"SMA NEGERI 5 CILEGON"}]
[null,null,{"$f":"CONCATENATE(MENU!$C$7,\" \",MENU!$D$7)","v":"TAHUN AJARAN 2013-2014"}]
[null,null,"KELAS",null,{"$f":"IF(ISBLANK(A126),\"\",VLOOKUP(A126,Data3,2))","v":"XII IPA-3"}]
[null,null,"NO","NIS","NAMA","L/P","NILAI RAPORT",null,null,"KET"]
[null,null,null,null,null,null,"Kognitif","Afektif","Psikomotor"]
[]
[{"$f":"+'DataBase-XI'!A119","v":91},{"$f":"IF(ISBLANK(A126),\"\",VLOOKUP(A126,Data3,2))","v":"XII IPA-3"},1,{"$f":"IF(ISBLANK(A126),\"\",VLOOKUP(A126,Data3,5))","v":"9965293057"},{"$f":"IF(ISBLANK(A126),\"\",VLOOKUP(A126,Data3,3))","v":"ADI FIRMANSYAH"},{"$f":"IF(ISBLANK(A126),\"\",VLOOKUP(A126,Data3,6))","v":"L"}]
[{"$f":"+A126+1","v":92},"XII IPA-3",2,0,0,0]
[93,"XII IPA-3",3,0,0,0]
[94,"XII IPA-3",4,0,0,0]
[95,"XII IPA-3",5,0,0,0]
[96,"XII IPA-3",6,0,0,0]
[97,"XII IPA-3",7,0,0,0]
[98,"XII IPA-3",8,0,0,0]
[99,"XII IPA-3",9,0,0,0]
[100,"XII IPA-3",10,0,0,0]
[101,"XII IPA-3",11,0,0,0]
[102,"XII IPA-3",12,0,0,0]
[103,"XII IPA-3",13,0,0,0]
[104,"XII IPA-3",14,0,0,0]
[105,"XII IPA-3",15,0,0,0]
[106,"XII IPA-3",16,0,0,0]
[107,"XII IPA-3",17,0,0,0]
[108,"XII IPA-3",18,0,0,0]
[109,"XII IPA-3",19,0,0,0]
[110,"XII IPA-3",20,0,0,0]
[111,"XII IPA-3",21,0,0,0]
[112,"XII IPA-3",22,0,0,0]
[113,"XII IPA-3",23,0,0,0]
[114,"XII IPA-3",24,0,0,0]
[115,"XII IPA-3",25,0,0,0]
[116,"XII IPA-3",26,0,0,0]
[117,"XII IPA-3",27,0,0,0]
[118,"XII IPA-3",28,0,0,0]
[119,"XII IPA-3",29,0,0,0]
[120,"XII IPA-3",30,0,0,0]
[121,"XII IPA-3",31,0,0,0]
[122,"XII IPA-3",32,0,0,0]
[123,"XII IPA-3",33,0,0,0]
[124,"XII IPA-3",34,0,0,0]
[125,"XII IPA-3",35,0,0,0]
[{"$f":"+A160+1","v":126},"XII IPA-3",36,0,0,0]
[{"$f":"+A161+1","v":127},"XII IPA-3",37,0,0,0]
[{"$f":"+A162+1","v":128},"XII IPA-3",38,0,0,0]
[{"$f":"+A163+1","v":129},"XII IPA-3",39,0,0,0]
[{"$f":"+A164+1","v":130},"XII IPA-3",40,0,0,0]
[]
[{"$f":"MAX(A126:A164)","v":129},null,null,null,"Jumlah Laki-laki",{"$f":"COUNTIF(F126:F165,\"L\")","v":1}]
[null,null,null,null,"Jumlah Perempuan",{"$f":"COUNTIF(F126:F165,\"P\")","v":0}]
[null,null,null,null,"Jumlah Total",{"$f":"SUM(F167:F168)","v":1}]
[]
[]
[]
[]
[]
[]
[]
[]
[]
[null,null,"DAFTAR NILAI SISWA"]
[null,null,{"$f":"+MENU!$D$8","v":"SMA NEGERI 5 CILEGON"}]
[null,null,{"$f":"CONCATENATE(MENU!$C$7,\" \",MENU!$D$7)","v":"TAHUN AJARAN 2013-2014"}]
[null,null,"KELAS",null,{"$f":"IF(ISBLANK(A186),\"\",VLOOKUP(A186,Data3,2))","v":"XII IPS-1"}]
[null,null,"NO","NIS","NAMA","L/P","NILAI RAPORT",null,null,"KET"]
[null,null,null,null,null,null,"Kognitif","Afektif","Psikomotor"]
[]
[{"$f":"+'DataBase-XI'!A176","v":136},{"$f":"IF(ISBLANK(A186),\"\",VLOOKUP(A186,Data3,2))","v":"XII IPS-1"},1,{"$f":"IF(ISBLANK(A186),\"\",VLOOKUP(A186,Data3,5))","v":"9962208731"},{"$f":"IF(ISBLANK(A186),\"\",VLOOKUP(A186,Data3,3))","v":"AGI PURNAMA BELRA"},{"$f":"IF(ISBLANK(A186),\"\",VLOOKUP(A186,Data3,6))","v":"L"}]
[{"$f":"+A186+1","v":137},"XII IPS-1",2,0,0,0]
[138,"XII IPS-1",3,0,0,0]
[139,"XII IPS-1",4,0,0,0]
[140,"XII IPS-1",5,0,0,0]
[141,"XII IPS-1",6,0,0,0]
[142,"XII IPS-1",7,0,0,0]
[143,"XII IPS-1",8,0,0,0]
[144,"XII IPS-1",9,0,0,0]
[145,"XII IPS-1",10,0,0,0]
[146,"XII IPS-1",11,0,0,0]
[147,"XII IPS-1",12,0,0,0]
[148,"XII IPS-1",13,0,0,0]
[149,"XII IPS-1",14,0,0,0]
[150,"XII IPS-1",15,0,0,0]
[151,"XII IPS-1",16,0,0,0]
[152,"XII IPS-1",17,0,0,0]
[153,"XII IPS-1",18,0,0,0]
[154,"XII IPS-1",19,0,0,0]
[155,"XII IPS-1",20,0,0,0]
[156,"XII IPS-1",21,0,0,0]
[157,"XII IPS-1",22,0,0,0]
[158,"XII IPS-1",23,0,0,0]
[159,"XII IPS-1",24,0,0,0]
[160,"XII IPS-1",25,0,0,0]
[161,"XII IPS-1",26,0,0,0]
[162,"XII IPS-1",27,0,0,0]
[163,"XII IPS-1",28,0,0,0]
[164,"XII IPS-1",29,0,0,0]
[165,"XII IPS-1",30,0,0,0]
[166,"XII IPS-1",31,0,0,0]
[167,"XII IPS-1",32,0,0,0]
[168,"XII IPS-1",33,0,0,0]
[169,"XII IPS-1",34,0,0,0]
[170,"XII IPS-1",35,0,0,0]
[{"$f":"+A220+1","v":171},"XII IPS-1",36,0,0,0]
[{"$f":"+A221+1","v":172},"XII IPS-1",37,0,0,0]
[{"$f":"+A222+1","v":173},"XII IPS-1",38,0,0,0]
[{"$f":"+A223+1","v":174},"XII IPS-1",39,0,0,0]
[{"$f":"+A224+1","v":175},"XII IPS-1",40,0,0,0]
[]
[{"$f":"MAX(A186:A224)","v":174},null,null,null,"Jumlah Laki-laki",{"$f":"COUNTIF(F186:F225,\"L\")","v":1}]
[null,null,null,null,"Jumlah Perempuan",{"$f":"COUNTIF(F186:F225,\"P\")","v":0}]
[null,null,null,null,"Jumlah Total",{"$f":"SUM(F227:F228)","v":1}]
[]
[]
[]
[]
[]
[]
[]
[]
[]
[null,null,"DAFTAR NILAI SISWA"]
[null,null,{"$f":"+MENU!$D$8","v":"SMA NEGERI 5 CILEGON"}]
[null,null,{"$f":"CONCATENATE(MENU!$C$7,\" \",MENU!$D$7)","v":"TAHUN AJARAN 2013-2014"}]
[null,null,"KELAS",null,{"$f":"IF(ISBLANK(A246),\"\",VLOOKUP(A246,Data3,2))","v":"XII IPS-2"}]
[null,null,"NO","NIS","NAMA","L/P","NILAI RAPORT",null,null,"KET"]
[null,null,null,null,null,null,"Kognitif","Afektif","Psikomotor"]
[]
[{"$f":"+'DataBase-XI'!A233","v":181},{"$f":"IF(ISBLANK(A246),\"\",VLOOKUP(A246,Data3,2))","v":"XII IPS-2"},1,{"$f":"IF(ISBLANK(A246),\"\",VLOOKUP(A246,Data3,5))","v":"9960471837"},{"$f":"IF(ISBLANK(A246),\"\",VLOOKUP(A246,Data3,3))","v":"AGUS GUNAWAN"},{"$f":"IF(ISBLANK(A246),\"\",VLOOKUP(A246,Data3,6))","v":"L"}]
[{"$f":"+A246+1","v":182},"XII IPS-2",2,0,0,0]
[183,"XII IPS-2",3,0,0,0]
[184,"XII IPS-2",4,0,0,0]
[185,"XII IPS-2",5,0,0,0]
[186,"XII IPS-2",6,0,0,0]
[187,"XII IPS-2",7,0,0,0]
[188,"XII IPS-2",8,0,0,0]
[189,"XII IPS-2",9,0,0,0]
[190,"XII IPS-2",10,0,0,0]
[191,"XII IPS-2",11,0,0,0]
[192,"XII IPS-2",12,0,0,0]
[193,"XII IPS-2",13,0,0,0]
[194,"XII IPS-2",14,0,0,0]
[195,"XII IPS-2",15,0,0,0]
[196,"XII IPS-2",16,0,0,0]
[197,"XII IPS-2",17,0,0,0]
[198,"XII IPS-2",18,0,0,0]
[199,"XII IPS-2",19,0,0,0]
[200,"XII IPS-2",20,0,0,0]
[201,"XII IPS-2",21,0,0,0]
[202,"XII IPS-2",22,0,0,0]
[203,"XII IPS-2",23,0,0,0]
[204,"XII IPS-2",24,0,0,0]
[205,"XII IPS-2",25,0,0,0]
[206,"XII IPS-2",26,0,0,0]
[207,"XII IPS-2",27,0,0,0]
[208,"XII IPS-2",28,0,0,0]
[209,"XII IPS-2",29,0,0,0]
[210,"XII IPS-2",30,0,0,0]
[211,"XII IPS-2",31,0,0,0]
[212,"XII IPS-2",32,0,0,0]
[213,"XII IPS-2",33,0,0,0]
[214,"XII IPS-2",34,0,0,0]
[215,"XII IPS-2",35,0,0,0]
[{"$f":"+A280+1","v":216},"XII IPS-2",36,0,0,0]
[{"$f":"+A281+1","v":217},"XII IPS-2",37,0,0,0]
[{"$f":"+A282+1","v":218},"XII IPS-2",38,0,0,0]
[{"$f":"+A283+1","v":219},"XII IPS-2",39,0,0,0]
[{"$f":"+A284+1","v":220},"XII IPS-2",40,0,0,0]
[]
[{"$f":"MAX(A246:A285)","v":220},null,null,null,"Jumlah Laki-laki",{"$f":"COUNTIF(F245:F285,\"L\")","v":1}]
[null,null,null,null,"Jumlah Perempuan",{"$f":"COUNTIF(F245:F285,\"P\")","v":0}]
[null,null,null,null,"Jumlah Total",{"$f":"SUM(F287:F288)","v":1}]
[]
[]
[]
[]
[]
[]
[]
[]
[]
[null,null,"DAFTAR NILAI SISWA"]
[null,null,{"$f":"+MENU!$D$8","v":"SMA NEGERI 5 CILEGON"}]
[null,null,{"$f":"CONCATENATE(MENU!$C$7,\" \",MENU!$D$7)","v":"TAHUN AJARAN 2013-2014"}]
[null,null,"KELAS",null,{"$f":"IF(ISBLANK(A306),\"\",VLOOKUP(A306,Data3,2))","v":"XII IPS-3"}]
[null,null,"NO","NIS","NAMA","L/P","NILAI RAPORT",null,null,"KET"]
[null,null,null,null,null,null,"Kognitif","Afektif","Psikomotor"]
[]
[{"$f":"+'DataBase-XI'!A290","v":226},{"$f":"IF(ISBLANK(A306),\"\",VLOOKUP(A306,Data3,2))","v":"XII IPS-3"},1,{"$f":"IF(ISBLANK(A306),\"\",VLOOKUP(A306,Data3,5))","v":"9960472157"},{"$f":"IF(ISBLANK(A306),\"\",VLOOKUP(A306,Data3,3))","v":"ANUGRAH PRATAMA"},{"$f":"IF(ISBLANK(A306),\"\",VLOOKUP(A306,Data3,6))","v":"L"}]
[{"$f":"+A306+1","v":227},"XII IPS-3",2,0,0,0]
[228,"XII IPS-3",3,0,0,0]
[229,"XII IPS-3",4,0,0,0]
[230,"XII IPS-3",5,0,0,0]
[231,"XII IPS-3",6,0,0,0]
[232,"XII IPS-3",7,0,0,0]
[233,"XII IPS-3",8,0,0,0]
[234,"XII IPS-3",9,0,0,0]
[235,"XII IPS-3",10,0,0,0]
[236,"XII IPS-3",11,0,0,0]
[237,"XII IPS-3",12,0,0,0]
[238,"XII IPS-3",13,0,0,0]
[239,"XII IPS-3",14,0,0,0]
[240,"XII IPS-3",15,0,0,0]
[241,"XII IPS-3",16,0,0,0]
[242,"XII IPS-3",17,0,0,0]
[243,"XII IPS-3",18,0,0,0]
[244,"XII IPS-3",19,0,0,0]
[245,"XII IPS-3",20,0,0,0]
[246,"XII IPS-3",21,0,0,0]
[247,"XII IPS-3",22,0,0,0]
[248,"XII IPS-3",23,0,0,0]
[249,"XII IPS-3",24,0,0,0]
[250,"XII IPS-3",25,0,0,0]
[251,"XII IPS-3",26,0,0,0]
[252,"XII IPS-3",27,0,0,0]
[253,"XII IPS-3",28,0,0,0]
[254,"XII IPS-3",29,0,0,0]
[255,"XII IPS-3",30,0,0,0]
[256,"XII IPS-3",31,0,0,0]
[257,"XII IPS-3",32,0,0,0]
[258,"XII IPS-3",33,0,0,0]
[259,"XII IPS-3",34,0,0,0]
[260,"XII IPS-3",35,0,0,0]
[{"$f":"+A340+1","v":261},"XII IPS-3",null,0,0,0]
[{"$f":"+A341+1","v":262},"XII IPS-3",null,0,0,0]
[{"$f":"+A342+1","v":263},"XII IPS-3",null,0,0,0]
[{"$f":"+A343+1","v":264},"XII IPS-3",null,0,0,0]
[{"$f":"+A344+1","v":265},"XII IPS-3",null,0,0,0]
[]
[null,null,null,null,"Jumlah Laki-laki",{"$f":"COUNTIF(F305:F345,\"L\")","v":1}]
[null,null,null,null,"Jumlah Perempuan",{"$f":"COUNTIF(F305:F345,\"P\")","v":0}]
[null,null,null,null,"Jumlah Total",{"$f":"SUM(F347:F348)","v":1}]

{"sheet":"Blanko-Daf Nilai XII","index":14,"n_rows":380,"n_cols":18,"rows_kept":380,"cut":false,"hidden":false,"merged":[[326,12,328,12],[326,13,327,14],[326,15,328,15],[262,13,263,14],[262,15,264,15],[320,2,320,15],[321,2,321,15],[322,2,322,15],[326,2,328,2],[326,3,328,3],[326,4,328,4],[326,5,328,5],[326,6,327,11],[262,2,264,2],[262,3,264,3],[262,4,264,4],[262,5,264,5],[262,6,263,11],[262,12,264,12],[198,12,200,12],[198,13,199,14],[198,15,200,15],[256,2,256,15],[257,2,257,15],[258,2,258,15],[134,13,135,14],[134,15,136,15],[192,2,192,15],[193,2,193,15],[194,2,194,15],[198,2,200,2],[198,3,200,3],[198,4,200,4],[198,5,200,5],[198,6,199,11],[134,2,136,2],[134,3,136,3],[134,4,136,4],[134,5,136,5],[134,6,135,11],[134,12,136,12],[70,12,72,12],[128,2,128,15],[129,2,129,15],[130,2,130,15],[70,2,72,2],[70,3,72,3],[70,4,72,4],[70,5,72,5],[70,6,71,11],[64,2,64,15],[65,2,65,15],[66,2,66,15],[70,13,71,14],[70,15,72,15],[0,0,8,0],[0,2,0,15],[1,2,1,15],[2,2,2,15],[6,2,8,2],[6,3,8,3],[6,4,8,4],[6,5,8,5],[6,6,7,11],[6,12,8,12],[6,13,7,14],[6,15,8,15]]}
["NO URUT DATABASE",null,"DAFTAR NILAI MURNI"]
[null,null,{"$f":"+MENU!$D$8","v":"SMA NEGERI 5 CILEGON"}]
[null,null,{"$f":"CONCATENATE(MENU!$C$7,\" \",MENU!$D$7)","v":"TAHUN AJARAN 2013-2014"}]
[]
[null,null,"MATA PELAJARAN",null,";",null,null,null,null,null,null,null,"Kelas/Semester:",null,null,{"$f":"+B10","v":"XII IPA-1"}]
[null,null,"NAMA SEKOLAH",null,{"$f":"+$C$2","v":"SMA NEGERI 5 CILEGON"}]
[null,null,"NO","NAMA SISWA","NISN","L/P","NILAI HARIAN / TUGAS",null,null,null,null,null,"RATA-RATA","KETUNTASAN",null,"KET"]
[]
[null,null,null,null,null,null,1,2,3,4,5,6,null,"YA","TIDAK"]
[{"$f":"+'DataBase-XI'!A5","v":1},{"$f":"IF(ISBLANK(A10),\"\",VLOOKUP(A10,Data3,2))","v":"XII IPA-1"},1,{"$f":"IF(ISBLANK(A10),\"\",VLOOKUP(A10,Data3,3))","v":"ADE ROSIHA"},{"$f":"IF(ISBLANK(A10),\"\",VLOOKUP(A10,Data3,5))","v":"9960473779"},{"$f":"IF(ISBLANK(A10),\"\",VLOOKUP(A10,Data3,6))","v":"P"}]
[2,"XII IPA-1",2,0,0,0]
[3,"XII IPA-1",3,0,0,0]
[4,"XII IPA-1",4,0,0,0]
[5,"XII IPA-1",5,0,0,0]
[6,"XII IPA-1",6,0,0,0]
[7,"XII IPA-1",7,0,0,0]
[8,"XII IPA-1",8,0,0,0]
[9,"XII IPA-1",9,0,0,0]
[10,"XII IPA-1",10,0,0,0]
[11,"XII IPA-1",11,0,0,0]
[12,"XII IPA-1",12,0,0,0]
[13,"XII IPA-1",13,0,0,0]
[14,"XII IPA-1",14,0,0,0]
[15,"XII IPA-1",15,0,0,0]
[16,"XII IPA-1",16,0,0,0]
[17,"XII IPA-1",17,0,0,0]
[18,"XII IPA-1",18,0,0,0]
[19,"XII IPA-1",19,0,0,0]
[20,"XII IPA-1",20,0,0,0]
[21,"XII IPA-1",21,0,0,0]
[22,"XII IPA-1",22,0,0,0]
[23,"XII IPA-1",23,0,0,0]
[24,"XII IPA-1",24,0,0,0]
[25,"XII IPA-1",25,0,0,0]
[26,"XII IPA-1",26,0,0,0]
[27,"XII IPA-1",27,0,0,0]
[28,"XII IPA-1",28,0,0,0]
[29,"XII IPA-1",29,0,0,0]
[30,"XII IPA-1",30,0,0,0]
[31,"XII IPA-1",31,0,0,0]
[32,"XII IPA-1",32,0,0,0]
[33,"XII IPA-1",33,0,0,0]
[34,"XII IPA-1",34,0,0,0]
[35,"XII IPA-1",35,0,0,0]
[36,"XII IPA-1",36,0,0,0]
[37,"XII IPA-1",37,0,0,0]
[38,"XII IPA-1",38,0,0,0]
[39,"XII IPA-1",39,0,0,0]
[40,"XII IPA-1",40,0,0,0]
[null,null,null,"Mengetahui",null,null,null,null,null,null,null,null,{"$f":"CONCATENATE(MENU!$D$13,\" ,   \",R50)","v":"Cilegon ,   24 Juli 2013"},null,null,null,null,{"$f":"TEXT(NOW(),\"dd mmmm yyyy\")","v":"24 Juli 2013"}]
[{"$f":"MAX(A10:A47)","v":38},null,null,"Waka Kurikulum",null,null,null,null,null,null,null,null,"Guru Bidang Study"]
[]
[]
[null,null,null,"................................",null,null,null,null,null,null,null,null,"................................"]
[null,null,null,"NIP: ",null,null,"Mengetahui",null,null,null,null,null,"NIP: "]
[null,null,null,null,null,null,"Kepala Sekolah"]
[]
[]
[null,null,null,null,null,null,{"$f":"+[1]MENU!$C$16","v":"Asep Mansur,S.Pd"}]
[null,null,null,null,null,null,{"$f":"+[1]MENU!$C$17","v":"NIP: 19620101 198512 1 004"}]
[]
[]
[]
[]
[null,null,"DAFTAR NILAI MURNI"]
[null,null,{"$f":"+$C$2","v":"SMA NEGERI 5 CILEGON"}]
[null,null,{"$f":"+$C$3","v":"TAHUN AJARAN 2013-2014"}]
[]
[null,null,"MATA PELAJARAN",null,";",null,null,null,null,null,null,null,"Kelas/Semester:",null,null,{"$f":"+B74","v":"XII IPA-2"}]
[null,null,"NAMA SEKOLAH",null,{"$f":"+$C$2","v":"SMA NEGERI 5 CILEGON"}]
[null,null,"NO","NAMA SISWA","NISN","L/P","NILAI HARIAN / TUGAS",null,null,null,null,null,"RATA-RATA","KETUNTASAN",null,"KET"]
[]
[null,null,null,null,null,null,1,2,3,4,5,6,null,"YA","TIDAK"]
[{"$f":"+'DataBase-XI'!A62","v":46},{"$f":"IF(ISBLANK(A74),\"\",VLOOKUP(A74,Data3,2))","v":"XII IPA-2"},1,{"$f":"IF(ISBLANK(A74),\"\",VLOOKUP(A74,Data3,3))","v":"ALLISYAARA NOERHUZA"},{"$f":"IF(ISBLANK(A74),\"\",VLOOKUP(A74,Data3,5))","v":"9960470745"},{"$f":"IF(ISBLANK(A74),\"\",VLOOKUP(A74,Data3,6))","v":"P"}]
[{"$f":"+A74+1","v":47},"XII IPA-2",2,0,0,0]
[48,"XII IPA-2",3,0,0,0]
[49,"XII IPA-2",4,0,0,0]
[50,"XII IPA-2",5,0,0,0]
[51,"XII IPA-2",6,0,0,0]
[52,"XII IPA-2",7,0,0,0]
[53,"XII IPA-2",8,0,0,0]
[54,"XII IPA-2",9,0,0,0]
[55,"XII IPA-2",10,0,0,0]
[56,"XII IPA-2",11,0,0,0]
[57,"XII IPA-2",12,0,0,0]
[58,"XII IPA-2",13,0,0,0]
[59,"XII IPA-2",14,0,0,0]
[60,"XII IPA-2",15,0,0,0]
[61,"XII IPA-2",16,0,0,0]
[62,"XII IPA-2",17,0,0,0]
[63,"XII IPA-2",18,0,0,0]
[64,"XII IPA-2",19,0,0,0]
[65,"XII IPA-2",20,0,0,0]
[66,"XII IPA-2",21,0,0,0]
[67,"XII IPA-2",22,0,0,0]
[68,"XII IPA-2",23,0,0,0]
[69,"XII IPA-2",24,0,0,0]
[70,"XII IPA-2",25,0,0,0]
[71,"XII IPA-2",26,0,0,0]
[72,"XII IPA-2",27,0,0,0]
[73,"XII IPA-2",28,0,0,0]
[74,"XII IPA-2",29,0,0,0]
[75,"XII IPA-2",30,0,0,0]
[76,"XII IPA-2",31,0,0,0]
[77,"XII IPA-2",32,0,0,0]
[78,"XII IPA-2",33,0,0,0]
[79,"XII IPA-2",34,0,0,0]
[80,"XII IPA-2",35,0,0,0]
[81,"XII IPA-2",36,0,0,0]
[82,"XII IPA-2",37,0,0,0]
[{"$f":"+A110+1","v":83},"XII IPA-2",38,0,0,0]
[{"$f":"+A111+1","v":84},"XII IPA-2",39,0,0,0]
[{"$f":"+A112+1","v":85},"XII IPA-2",40,0,0,0]
[null,null,null,"Mengetahui",null,null,null,null,null,null,null,null,{"$f":"CONCATENATE(MENU!$D$13,\" ,   \",R114)","v":"Cilegon ,   24 Juli 2013"},null,null,null,null,{"$f":"TEXT(NOW(),\"dd mmmm yyyy\")","v":"24 Juli 2013"}]
[{"$f":"MAX(A74:A112)","v":84},null,null,"Waka Kurikulum",null,null,null,null,null,null,null,null,"Guru Bidang Study"]
[]
[]
[null,null,null,"................................",null,null,null,null,null,null,null,null,"................................"]
[null,null,null,"NIP: ",null,null,"Mengetahui",null,null,null,null,null,"NIP: "]
[null,null,null,null,null,null,"Kepala Sekolah"]
[]
[]
[null,null,null,null,null,null,{"$f":"+[1]MENU!$C$16","v":"Asep Mansur,S.Pd"}]
[null,null,null,null,null,null,{"$f":"+[1]MENU!$C$17","v":"NIP: 19620101 198512 1 004"}]
[]
[]
[]
[]
[null,null,"DAFTAR NILAI MURNI"]
[null,null,{"$f":"+$C$2","v":"SMA NEGERI 5 CILEGON"}]
[null,null,{"$f":"+$C$3","v":"TAHUN AJARAN 2013-2014"}]
[]
[null,null,"MATA PELAJARAN",null,";",null,null,null,null,null,null,null,"Kelas/Semester:",null,null,{"$f":"+B138","v":"XII IPA-3"}]
[null,null,"NAMA SEKOLAH",null,{"$f":"+$C$2","v":"SMA NEGERI 5 CILEGON"}]
[null,null,"NO","NAMA SISWA","NISN","L/P","NILAI HARIAN / TUGAS",null,null,null,null,null,"RATA-RATA","KETUNTASAN",null,"KET"]
[]
[null,null,null,null,null,null,1,2,3,4,5,6,null,"YA","TIDAK"]
[{"$f":"+'DataBase-XI'!A119","v":91},{"$f":"IF(ISBLANK(A138),\"\",VLOOKUP(A138,Data3,2))","v":"XII IPA-3"},1,{"$f":"IF(ISBLANK(A138),\"\",VLOOKUP(A138,Data3,3))","v":"ADI FIRMANSYAH"},{"$f":"IF(ISBLANK(A138),\"\",VLOOKUP(A138,Data3,5))","v":"9965293057"},{"$f":"IF(ISBLANK(A138),\"\",VLOOKUP(A138,Data3,6))","v":"L"}]
[{"$f":"+A138+1","v":92},"XII IPA-3",2,0,0,0]
[93,"XII IPA-3",3,0,0,0]
[94,"XII IPA-3",4,0,0,0]
[95,"XII IPA-3",5,0,0,0]
[96,"XII IPA-3",6,0,0,0]
[97,"XII IPA-3",7,0,0,0]
[98,"XII IPA-3",8,0,0,0]
[99,"XII IPA-3",9,0,0,0]
[100,"XII IPA-3",10,0,0,0]
[101,"XII IPA-3",11,0,0,0]
[102,"XII IPA-3",12,0,0,0]
[103,"XII IPA-3",13,0,0,0]
[104,"XII IPA-3",14,0,0,0]
[105,"XII IPA-3",15,0,0,0]
[106,"XII IPA-3",16,0,0,0]
[107,"XII IPA-3",17,0,0,0]
[108,"XII IPA-3",18,0,0,0]
[109,"XII IPA-3",19,0,0,0]
[110,"XII IPA-3",20,0,0,0]
[111,"XII IPA-3",21,0,0,0]
[112,"XII IPA-3",22,0,0,0]
[113,"XII IPA-3",23,0,0,0]
[114,"XII IPA-3",24,0,0,0]
[115,"XII IPA-3",25,0,0,0]
[116,"XII IPA-3",26,0,0,0]
[117,"XII IPA-3",27,0,0,0]
[118,"XII IPA-3",28,0,0,0]
[119,"XII IPA-3",29,0,0,0]
[120,"XII IPA-3",30,0,0,0]
[121,"XII IPA-3",31,0,0,0]
[122,"XII IPA-3",32,0,0,0]
[123,"XII IPA-3",33,0,0,0]
[124,"XII IPA-3",34,0,0,0]
[125,"XII IPA-3",35,0,0,0]
[{"$f":"+A172+1","v":126},"XII IPA-3",36,0,0,0]
[{"$f":"+A173+1","v":127},"XII IPA-3",37,0,0,0]
[{"$f":"+A174+1","v":128},"XII IPA-3",38,0,0,0]
[{"$f":"+A175+1","v":129},"XII IPA-3",39,0,0,0]
[{"$f":"+A176+1","v":130},"XII IPA-3",40,0,0,0]
[null,null,null,"Mengetahui",null,null,null,null,null,null,null,null,{"$f":"CONCATENATE(MENU!$D$13,\" ,   \",R178)","v":"Cilegon ,   24 Juli 2013"},null,null,null,null,{"$f":"TEXT(NOW(),\"dd mmmm yyyy\")","v":"24 Juli 2013"}]
[{"$f":"MAX(A138:A176)","v":129},null,null,"Waka Kurikulum",null,null,null,null,null,null,null,null,"Guru Bidang Study"]
[]
[]
[null,null,null,"................................",null,null,null,null,null,null,null,null,"................................"]
[null,null,null,"NIP: ",null,null,"Mengetahui",null,null,null,null,null,"NIP: "]
[null,null,null,null,null,null,"Kepala Sekolah"]
[]
[]
[null,null,null,null,null,null,{"$f":"+[1]MENU!$C$16","v":"Asep Mansur,S.Pd"}]
[null,null,null,null,null,null,{"$f":"+[1]MENU!$C$17","v":"NIP: 19620101 198512 1 004"}]
[]
[]
[]
[]
[null,null,"DAFTAR NILAI MURNI"]
[null,null,{"$f":"+$C$2","v":"SMA NEGERI 5 CILEGON"}]
[null,null,{"$f":"+$C$3","v":"TAHUN AJARAN 2013-2014"}]
[]
[null,null,"MATA PELAJARAN",null,";",null,null,null,null,null,null,null,"Kelas/Semester:",null,null,{"$f":"+B202","v":"XII IPS-1"}]
[null,null,"NAMA SEKOLAH",null,{"$f":"+$C$2","v":"SMA NEGERI 5 CILEGON"}]
[null,null,"NO","NAMA SISWA","NISN","L/P","NILAI HARIAN / TUGAS",null,null,null,null,null,"RATA-RATA","KETUNTASAN",null,"KET"]
[]
[null,null,null,null,null,null,1,2,3,4,5,6,null,"YA","TIDAK"]
[{"$f":"+'DataBase-XI'!A176","v":136},{"$f":"IF(ISBLANK(A202),\"\",VLOOKUP(A202,Data3,2))","v":"XII IPS-1"},1,{"$f":"IF(ISBLANK(A202),\"\",VLOOKUP(A202,Data3,3))","v":"AGI PURNAMA BELRA"},{"$f":"IF(ISBLANK(A202),\"\",VLOOKUP(A202,Data3,5))","v":"9962208731"},{"$f":"IF(ISBLANK(A202),\"\",VLOOKUP(A202,Data3,6))","v":"L"}]
[{"$f":"+A202+1","v":137},"XII IPS-1",2,0,0,0]
[138,"XII IPS-1",3,0,0,0]
[139,"XII IPS-1",4,0,0,0]
[140,"XII IPS-1",5,0,0,0]
[141,"XII IPS-1",6,0,0,0]
[142,"XII IPS-1",7,0,0,0]
[143,"XII IPS-1",8,0,0,0]
[144,"XII IPS-1",9,0,0,0]
[145,"XII IPS-1",10,0,0,0]
[146,"XII IPS-1",11,0,0,0]
[147,"XII IPS-1",12,0,0,0]
[148,"XII IPS-1",13,0,0,0]
[149,"XII IPS-1",14,0,0,0]
[150,"XII IPS-1",15,0,0,0]
[151,"XII IPS-1",16,0,0,0]
[152,"XII IPS-1",17,0,0,0]
[153,"XII IPS-1",18,0,0,0]
[154,"XII IPS-1",19,0,0,0]
[155,"XII IPS-1",20,0,0,0]
[156,"XII IPS-1",21,0,0,0]
[157,"XII IPS-1",22,0,0,0]
[158,"XII IPS-1",23,0,0,0]
[159,"XII IPS-1",24,0,0,0]
[160,"XII IPS-1",25,0,0,0]
[161,"XII IPS-1",26,0,0,0]
[162,"XII IPS-1",27,0,0,0]
[163,"XII IPS-1",28,0,0,0]
[164,"XII IPS-1",29,0,0,0]
[165,"XII IPS-1",30,0,0,0]
[166,"XII IPS-1",31,0,0,0]
[167,"XII IPS-1",32,0,0,0]
[168,"XII IPS-1",33,0,0,0]
[169,"XII IPS-1",34,0,0,0]
[170,"XII IPS-1",35,0,0,0]
[{"$f":"+A236+1","v":171},"XII IPS-1",36,0,0,0]
[{"$f":"+A237+1","v":172},"XII IPS-1",37,0,0,0]
[{"$f":"+A238+1","v":173},"XII IPS-1",38,0,0,0]
[{"$f":"+A239+1","v":174},"XII IPS-1",39,0,0,0]
[{"$f":"+A240+1","v":175},"XII IPS-1",40,0,0,0]
[null,null,null,"Mengetahui",null,null,null,null,null,null,null,null,{"$f":"CONCATENATE(MENU!$D$13,\" ,   \",R242)","v":"Cilegon ,   24 Juli 2013"},null,null,null,null,{"$f":"TEXT(NOW(),\"dd mmmm yyyy\")","v":"24 Juli 2013"}]
[{"$f":"MAX(A202:A240)","v":174},null,null,"Waka Kurikulum",null,null,null,null,null,null,null,null,"Guru Bidang Study"]
[]
[]
[null,null,null,"................................",null,null,null,null,null,null,null,null,"................................"]
[null,null,null,"NIP: ",null,null,"Mengetahui",null,null,null,null,null,"NIP: "]
[null,null,null,null,null,null,"Kepala Sekolah"]
[]
[]
[null,null,null,null,null,null,{"$f":"+[1]MENU!$C$16","v":"Asep Mansur,S.Pd"}]
[null,null,null,null,null,null,{"$f":"+[1]MENU!$C$17","v":"NIP: 19620101 198512 1 004"}]
[]
[]
[]
[]
[null,null,"DAFTAR NILAI MURNI"]
[null,null,{"$f":"+$C$2","v":"SMA NEGERI 5 CILEGON"}]
[null,null,{"$f":"+$C$3","v":"TAHUN AJARAN 2013-2014"}]
[]
[null,null,"MATA PELAJARAN",null,";",null,null,null,null,null,null,null,"Kelas/Semester:",null,null,{"$f":"+B266","v":"XII IPS-2"}]
[null,null,"NAMA SEKOLAH",null,{"$f":"+$C$2","v":"SMA NEGERI 5 CILEGON"}]
[null,null,"NO","NAMA SISWA","NISN","L/P","NILAI HARIAN / TUGAS",null,null,null,null,null,"RATA-RATA","KETUNTASAN",null,"KET"]
[]
[null,null,null,null,null,null,1,2,3,4,5,6,null,"YA","TIDAK"]
[{"$f":"+'DataBase-XI'!A233","v":181},{"$f":"IF(ISBLANK(A266),\"\",VLOOKUP(A266,Data3,2))","v":"XII IPS-2"},1,{"$f":"IF(ISBLANK(A266),\"\",VLOOKUP(A266,Data3,3))","v":"AGUS GUNAWAN"},{"$f":"IF(ISBLANK(A266),\"\",VLOOKUP(A266,Data3,5))","v":"9960471837"},{"$f":"IF(ISBLANK(A266),\"\",VLOOKUP(A266,Data3,6))","v":"L"}]
[{"$f":"+A266+1","v":182},"XII IPS-2",2,0,0,0]
[183,"XII IPS-2",3,0,0,0]
[184,"XII IPS-2",4,0,0,0]
[185,"XII IPS-2",5,0,0,0]
[186,"XII IPS-2",6,0,0,0]
[187,"XII IPS-2",7,0,0,0]
[188,"XII IPS-2",8,0,0,0]
[189,"XII IPS-2",9,0,0,0]
[190,"XII IPS-2",10,0,0,0]
[191,"XII IPS-2",11,0,0,0]
[192,"XII IPS-2",12,0,0,0]
[193,"XII IPS-2",13,0,0,0]
[194,"XII IPS-2",14,0,0,0]
[195,"XII IPS-2",15,0,0,0]
[196,"XII IPS-2",16,0,0,0]
[197,"XII IPS-2",17,0,0,0]
[198,"XII IPS-2",18,0,0,0]
[199,"XII IPS-2",19,0,0,0]
[200,"XII IPS-2",20,0,0,0]
[201,"XII IPS-2",21,0,0,0]
[202,"XII IPS-2",22,0,0,0]
[203,"XII IPS-2",23,0,0,0]
[204,"XII IPS-2",24,0,0,0]
[205,"XII IPS-2",25,0,0,0]
[206,"XII IPS-2",26,0,0,0]
[207,"XII IPS-2",27,0,0,0]
[208,"XII IPS-2",28,0,0,0]
[209,"XII IPS-2",29,0,0,0]
[210,"XII IPS-2",30,0,0,0]
[211,"XII IPS-2",31,0,0,0]
[212,"XII IPS-2",32,0,0,0]
[213,"XII IPS-2",33,0,0,0]
[214,"XII IPS-2",34,0,0,0]
[215,"XII IPS-2",35,0,0,0]
[{"$f":"+A300+1","v":216},"XII IPS-2",36,0,0,0]
[{"$f":"+A301+1","v":217},"XII IPS-2",37,0,0,0]
[{"$f":"+A302+1","v":218},"XII IPS-2",38,0,0,0]
[{"$f":"+A303+1","v":219},"XII IPS-2",39,0,0,0]
[{"$f":"+A304+1","v":220},"XII IPS-2",40,0,0,0]
[null,null,null,"Mengetahui",null,null,null,null,null,null,null,null,{"$f":"CONCATENATE(MENU!$D$13,\" ,   \",R306)","v":"Cilegon ,   24 Juli 2013"},null,null,null,null,{"$f":"TEXT(NOW(),\"dd mmmm yyyy\")","v":"24 Juli 2013"}]
[{"$f":"MAX(A266:A305)","v":220},null,null,"Waka Kurikulum",null,null,null,null,null,null,null,null,"Guru Bidang Study"]
[]
[]
[null,null,null,"................................",null,null,null,null,null,null,null,null,"................................"]
[null,null,null,"NIP: ",null,null,"Mengetahui",null,null,null,null,null,"NIP: "]
[null,null,null,null,null,null,"Kepala Sekolah"]
[]
[]
[null,null,null,null,null,null,{"$f":"+[1]MENU!$C$16","v":"Asep Mansur,S.Pd"}]
[null,null,null,null,null,null,{"$f":"+[1]MENU!$C$17","v":"NIP: 19620101 198512 1 004"}]
[]
[]
[]
[]
[null,null,"DAFTAR NILAI MURNI"]
[null,null,{"$f":"+$C$2","v":"SMA NEGERI 5 CILEGON"}]
[null,null,{"$f":"+$C$3","v":"TAHUN AJARAN 2013-2014"}]
[]
[null,null,"MATA PELAJARAN",null,";",null,null,null,null,null,null,null,"Kelas/Semester:",null,null,{"$f":"+B330","v":"XII IPS-3"}]
[null,null,"NAMA SEKOLAH",null,{"$f":"+$C$2","v":"SMA NEGERI 5 CILEGON"}]
[null,null,"NO","NAMA SISWA","NISN","L/P","NILAI HARIAN / TUGAS",null,null,null,null,null,"RATA-RATA","KETUNTASAN",null,"KET"]
[]
[null,null,null,null,null,null,1,2,3,4,5,6,null,"YA","TIDAK"]
[{"$f":"+'DataBase-XI'!A290","v":226},{"$f":"IF(ISBLANK(A330),\"\",VLOOKUP(A330,Data3,2))","v":"XII IPS-3"},1,{"$f":"IF(ISBLANK(A330),\"\",VLOOKUP(A330,Data3,3))","v":"ANUGRAH PRATAMA"},{"$f":"IF(ISBLANK(A330),\"\",VLOOKUP(A330,Data3,5))","v":"9960472157"},{"$f":"IF(ISBLANK(A330),\"\",VLOOKUP(A330,Data3,6))","v":"L"}]
[{"$f":"+A330+1","v":227},"XII IPS-3",2,0,0,0]
[228,"XII IPS-3",3,0,0,0]
[229,"XII IPS-3",4,0,0,0]
[230,"XII IPS-3",5,0,0,0]
[231,"XII IPS-3",6,0,0,0]
[232,"XII IPS-3",7,0,0,0]
[233,"XII IPS-3",8,0,0,0]
[234,"XII IPS-3",9,0,0,0]
[235,"XII IPS-3",10,0,0,0]
[236,"XII IPS-3",11,0,0,0]
[237,"XII IPS-3",12,0,0,0]
[238,"XII IPS-3",13,0,0,0]
[239,"XII IPS-3",14,0,0,0]
[240,"XII IPS-3",15,0,0,0]
[241,"XII IPS-3",16,0,0,0]
[242,"XII IPS-3",17,0,0,0]
[243,"XII IPS-3",18,0,0,0]
[244,"XII IPS-3",19,0,0,0]
[245,"XII IPS-3",20,0,0,0]
[246,"XII IPS-3",21,0,0,0]
[247,"XII IPS-3",22,0,0,0]
[248,"XII IPS-3",23,0,0,0]
[249,"XII IPS-3",24,0,0,0]
[250,"XII IPS-3",25,0,0,0]
[251,"XII IPS-3",26,0,0,0]
[252,"XII IPS-3",27,0,0,0]
[253,"XII IPS-3",28,0,0,0]
[254,"XII IPS-3",29,0,0,0]
[255,"XII IPS-3",30,0,0,0]
[256,"XII IPS-3",31,0,0,0]
[257,"XII IPS-3",32,0,0,0]
[258,"XII IPS-3",33,0,0,0]
[259,"XII IPS-3",34,0,0,0]
[260,"XII IPS-3",35,0,0,0]
[{"$f":"+A364+1","v":261},"XII IPS-3",36,0,0,0]
[{"$f":"+A365+1","v":262},"XII IPS-3",37,0,0,0]
[{"$f":"+A366+1","v":263},"XII IPS-3",38,0,0,0]
[{"$f":"+A367+1","v":264},"XII IPS-3",39,0,0,0]
[{"$f":"+A368+1","v":265},"XII IPS-3",40,0,0,0]
[null,null,null,"Mengetahui",null,null,null,null,null,null,null,null,{"$f":"CONCATENATE(MENU!$D$13,\" ,   \",R370)","v":"Cilegon ,   24 Juli 2013"},null,null,null,null,{"$f":"TEXT(NOW(),\"dd mmmm yyyy\")","v":"24 Juli 2013"}]
[null,null,null,"Waka Kurikulum",null,null,null,null,null,null,null,null,"Guru Bidang Study"]
[]
[]
[null,null,null,"................................",null,null,null,null,null,null,null,null,"................................"]
[null,null,null,"NIP: ",null,null,"Mengetahui",null,null,null,null,null,"NIP: "]
[null,null,null,null,null,null,"Kepala Sekolah"]
[]
[]
[null,null,null,null,null,null,{"$f":"+[1]MENU!$C$16","v":"Asep Mansur,S.Pd"}]
[null,null,null,null,null,null,{"$f":"+[1]MENU!$C$17","v":"NIP: 19620101 198512 1 004"}]

{"sheet":"Jml_X","index":15,"n_rows":49,"n_cols":14,"rows_kept":49,"cut":false,"hidden":false,"merged":[[28,10,29,10],[28,11,29,11],[28,12,29,12],[28,13,29,13],[12,10,14,13],[15,10,16,10],[15,11,16,11],[15,12,16,12],[15,13,16,13],[6,5,7,5],[8,5,9,5],[10,5,11,5],[0,0,0,8],[1,0,1,8],[2,0,2,4],[4,0,5,0],[4,1,5,1],[4,2,5,2],[4,3,5,3],[4,4,5,4],[4,5,5,5],[4,6,4,8],[12,0,12,1],[14,0,14,6],[29,4,30,4],[29,5,30,5],[29,6,30,6],[15,1,16,1],[15,2,16,2],[15,3,16,3],[36,0,36,7],[15,4,16,4],[15,5,16,5],[15,6,16,6],[25,1,25,7],[28,0,28,6],[28,7,30,7],[29,0,30,0],[29,1,30,1],[29,2,30,2],[29,3,30,3],[14,7,16,7],[15,0,16,0]]}
["LAPORAN REKAPITULASI SISWA"]
[{"$f":"+MENU!$D$8","v":"SMA NEGERI 5 CILEGON"}]
[{"$f":"+MENU!$C$7","v":"TAHUN AJARAN"},null,null,null,null,{"$f":"+MENU!$D$7","v":"2013-2014"}]
[]
["ROMBEL","KELAS","Laki-laki","Perempuan","Jmlh Total / Rombel","Jml Total/ Jurusan","Berdasar asal sekolah Siswa / Kelas"]
[null,null,null,null,null,null,"SMP","MTS","Total"]
[1,{"$f":"+'DataBase-X'!$B$5","v":"X-1"},{"$f":"+'DataBase-X'!$F$50","v":0},{"$f":"+'DataBase-X'!$F$51","v":1},{"$f":"SUM(C7:D7)","v":1},{"$f":"SUM(E7:E8)","v":2},{"$f":"+'DataBase-X'!$U$50","v":0},{"$f":"+'DataBase-X'!$U$51","v":0},{"$f":"+'DataBase-X'!$U$52","v":0}]
[2,{"$f":"+'DataBase-X'!$B$62","v":"X-2"},{"$f":"+'DataBase-X'!$F$107","v":1},{"$f":"+'DataBase-X'!$F$108","v":0},1,null,{"$f":"+'DataBase-X'!$U$107","v":0},{"$f":"+'DataBase-X'!$U$108","v":0},{"$f":"+'DataBase-X'!$U$109","v":0}]
[3,{"$f":"+'DataBase-X'!$B$119","v":"X-3"},{"$f":"+'DataBase-X'!$F$164","v":0},{"$f":"+'DataBase-X'!$F$165","v":1},1,{"$f":"SUM(E9:E10)","v":2},{"$f":"+'DataBase-X'!$U$164","v":0},{"$f":"+'DataBase-X'!$U$165","v":0},{"$f":"+'DataBase-X'!$U$166","v":0}]
[4,{"$f":"+'DataBase-X'!$B$176","v":"X-4"},{"$f":"+'DataBase-X'!$F$221","v":1},{"$f":"+'DataBase-X'!$F$222","v":0},1,null,{"$f":"+'DataBase-X'!$U$221","v":0},{"$f":"+'DataBase-X'!$U$222","v":0},{"$f":"+'DataBase-X'!$U$223","v":0}]
[5,{"$f":"+'DataBase-X'!$B$233","v":"X-5"},{"$f":"+'DataBase-X'!$F$278","v":1},{"$f":"+'DataBase-X'!$F$279","v":0},1,{"$f":"SUM(E11:E12)","v":2},{"$f":"+'DataBase-X'!$U$278","v":0},{"$f":"+'DataBase-X'!$U$279","v":0},{"$f":"+'DataBase-X'!$U$280","v":0}]
[6,{"$f":"+'DataBase-X'!$B$290","v":"X-6"},{"$f":"+'DataBase-X'!$F$335","v":1},{"$f":"+'DataBase-X'!$F$336","v":0},1,null,{"$f":"+'DataBase-X'!$U$335","v":0},{"$f":"+'DataBase-X'!$U$336","v":0},{"$f":"+'DataBase-X'!$U$337","v":0}]
["JUMLAH",null,{"$f":"SUM(C7:C12)","v":4},2,6,6,0,0,0,null,"Siswa Menurut Jenis Kelamin dan kelompok Umur"]
[]
["Siswa Menurut Jenis Kelamin dan kelompok Umur",null,null,null,null,null,null,"Total"]
["Umur",{"$f":"+$B$7","v":"X-1"},{"$f":"+$B$8","v":"X-2"},{"$f":"+$B$9","v":"X-3"},{"$f":"+$B$10","v":"X-4"},{"$f":"+$B$11","v":"X-5"},{"$f":"+$B$12","v":"X-6"},null,null,null,"Umur","L","P","JML"]
[]
["13 tahun",{"$f":"+'DataBase-X'!K55","v":0},{"$f":"+'DataBase-X'!K112","v":0},{"$f":"+'DataBase-X'!K169","v":0},{"$f":"+'DataBase-X'!K226","v":0},{"$f":"+'DataBase-X'!K283","v":0},{"$f":"+'DataBase-X'!K340","v":0},{"$f":"SUM(B18:G18)","v":0},null,null,"13 tahun",{"$f":"+'DataBase-X'!M414","v":0},{"$f":"+'DataBase-X'!M415","v":0},{"$f":"SUM(L18:M18)","v":0}]
["14 tahun",{"$f":"+'DataBase-X'!K50","v":1},{"$f":"+'DataBase-X'!K107","v":0},{"$f":"+'DataBase-X'!K164","v":1},{"$f":"+'DataBase-X'!K221","v":1},{"$f":"+'DataBase-X'!K278","v":0},{"$f":"+'DataBase-X'!K335","v":0},3,null,null,"14 tahun",{"$f":"+'DataBase-X'!M416","v":2},{"$f":"+'DataBase-X'!M417","v":1},{"$f":"SUM(L19:M19)","v":3}]
["15 tahun",{"$f":"+'DataBase-X'!K51","v":0},{"$f":"+'DataBase-X'!K108","v":1},{"$f":"+'DataBase-X'!K165","v":0},{"$f":"+'DataBase-X'!K222","v":0},{"$f":"+'DataBase-X'!K279","v":1},{"$f":"+'DataBase-X'!K336","v":1},3,null,null,"15 tahun",{"$f":"+'DataBase-X'!M418","v":0},{"$f":"+'DataBase-X'!M419","v":3},3]
["16 tahun",{"$f":"+'DataBase-X'!K52","v":0},{"$f":"+'DataBase-X'!K109","v":0},{"$f":"+'DataBase-X'!K166","v":0},{"$f":"+'DataBase-X'!K223","v":0},{"$f":"+'DataBase-X'!K280","v":0},{"$f":"+'DataBase-X'!K337","v":0},0,null,null,"16 tahun",{"$f":"+'DataBase-X'!M420","v":0},{"$f":"+'DataBase-X'!M421","v":0},0]
["17 tahun",{"$f":"+'DataBase-X'!K53","v":0},{"$f":"+'DataBase-X'!K110","v":0},{"$f":"+'DataBase-X'!K167","v":0},{"$f":"+'DataBase-X'!K224","v":0},{"$f":"+'DataBase-X'!K281","v":0},{"$f":"+'DataBase-X'!K338","v":0},0,null,null,"17 tahun",{"$f":"+'DataBase-X'!M422","v":0},{"$f":"+'DataBase-X'!M423","v":0},0]
["18 tahun",{"$f":"+'DataBase-X'!K54","v":0},{"$f":"+'DataBase-X'!K111","v":0},{"$f":"+'DataBase-X'!K168","v":0},{"$f":"+'DataBase-X'!K225","v":0},{"$f":"+'DataBase-X'!K282","v":0},{"$f":"+'DataBase-X'!K339","v":0},0,null,null,"18 tahun",{"$f":"+'DataBase-X'!M424","v":0},{"$f":"+'DataBase-X'!M425","v":0},0]
["19 tahun",{"$f":"+'DataBase-X'!K56","v":0},{"$f":"+'DataBase-X'!K113","v":0},{"$f":"+'DataBase-X'!K170","v":0},{"$f":"+'DataBase-X'!K227","v":0},{"$f":"+'DataBase-X'!K284","v":0},{"$f":"+'DataBase-X'!K341","v":0},{"$f":"SUM(B24:G24)","v":0},null,null,"19 tahun",{"$f":"+'DataBase-X'!M426","v":0},{"$f":"+'DataBase-X'!M427","v":0},0]
[null,null,null,null,null,null,null,null,null,null,"20 tahun",{"$f":"+'DataBase-X'!M428","v":0},{"$f":"+'DataBase-X'!M429","v":0},0]
[null,null,null,null,null,null,null,null,null,null,"21 tahun",{"$f":"+'DataBase-X'!M430","v":0},{"$f":"+'DataBase-X'!M431","v":0},0]
["Jumlah 2)",{"$f":"SUM(B18:B26)","v":1},{"$f":"SUM(C18:C26)","v":1},1,1,1,1,{"$f":"SUM(H18:H26)","v":6},null,null,"22 tahun",{"$f":"+'DataBase-X'!M432","v":0},{"$f":"+'DataBase-X'!M433","v":0},0]
[]
["Siswa  berdasarkan Agama",null,null,null,null,null,null,"Total",null,null,"TOTAL",{"$f":"SUM(L18:L28)","v":2},{"$f":"SUM(M18:M28)","v":4},{"$f":"SUM(L29:M29)","v":6}]
["Agama",{"$f":"+$B$7","v":"X-1"},{"$f":"+$B$8","v":"X-2"},{"$f":"+$B$9","v":"X-3"},{"$f":"+$B$10","v":"X-4"},{"$f":"+$B$11","v":"X-5"},{"$f":"+$B$12","v":"X-6"}]
[]
["Islam",{"$f":"+'DataBase-X'!W50","v":0},{"$f":"+'DataBase-X'!W107","v":0},{"$f":"+'DataBase-X'!W164","v":0},{"$f":"+'DataBase-X'!W221","v":0},{"$f":"+'DataBase-X'!W278","v":0},{"$f":"+'DataBase-X'!W335","v":0},{"$f":"SUM(B32:G32)","v":0}]
["Katolik",{"$f":"+'DataBase-X'!W51","v":0},{"$f":"+'DataBase-X'!W108","v":0},{"$f":"+'DataBase-X'!W165","v":0},{"$f":"+'DataBase-X'!W222","v":0},{"$f":"+'DataBase-X'!W279","v":0},{"$f":"+'DataBase-X'!W336","v":0},{"$f":"SUM(B33:G33)","v":0}]
["Protestan",{"$f":"+'DataBase-X'!W52","v":0},{"$f":"+'DataBase-X'!W109","v":0},{"$f":"+'DataBase-X'!W166","v":0},{"$f":"+'DataBase-X'!W223","v":0},{"$f":"+'DataBase-X'!W280","v":0},{"$f":"+'DataBase-X'!W337","v":0},{"$f":"SUM(B34:G34)","v":0}]
["Hindu",{"$f":"+'DataBase-X'!W53","v":0},{"$f":"+'DataBase-X'!W110","v":0},{"$f":"+'DataBase-X'!W167","v":0},{"$f":"+'DataBase-X'!W224","v":0},{"$f":"+'DataBase-X'!W281","v":0},{"$f":"+'DataBase-X'!W338","v":0},{"$f":"SUM(B35:G35)","v":0}]
["Budha",{"$f":"+'DataBase-X'!W54","v":0},{"$f":"+'DataBase-X'!W111","v":0},{"$f":"+'DataBase-X'!W168","v":0},{"$f":"+'DataBase-X'!W225","v":0},{"$f":"+'DataBase-X'!W282","v":0},{"$f":"+'DataBase-X'!W339","v":0},{"$f":"SUM(B36:G36)","v":0}]
[]
[null,{"$f":"SUM(B32:B36)","v":0},0,0,0,0,0,0]
[]
[null,null,null,null,null,{"$f":"CONCATENATE(MENU!$D$13,\" ,   \",K40)","v":"Cilegon ,   24 Juli 2013"},null,null,null,null,{"$f":"TEXT(NOW(),\"dd mmmm yyyy\")","v":"24 Juli 2013"}]
[null,null,null,null,null,"Kepala Sekolah"]
[]
[]
[]
[]
[]
[null,null,null,null,null,{"$f":"+MENU!$D$9","v":"Asep Mansur, M.Pd"}]
[null,null,null,null,null,"Pembina"]
[null,null,null,null,null,{"$f":"+MENU!$D$10","v":"NIP. 19620101 198512 1 004"}]

{"sheet":"Jml_XI","index":16,"n_rows":49,"n_cols":14,"rows_kept":49,"cut":false,"hidden":false,"merged":[[28,10,29,10],[28,11,29,11],[28,12,29,12],[28,13,29,13],[12,10,14,13],[15,10,16,10],[15,11,16,11],[15,12,16,12],[15,13,16,13],[15,1,16,1],[15,2,16,2],[15,3,16,3],[4,2,5,2],[4,3,5,3],[0,0,0,8],[1,0,1,8],[2,0,2,4],[4,0,5,0],[4,1,5,1],[4,4,5,4],[4,5,5,5],[4,6,4,8],[6,5,7,5],[8,5,9,5],[10,5,11,5],[12,0,12,1],[14,0,14,6],[36,0,36,7],[15,4,16,4],[15,5,16,5],[15,6,16,6],[25,1,25,7],[28,0,28,6],[28,7,30,7],[29,0,30,0],[29,1,30,1],[29,2,30,2],[29,3,30,3],[29,4,30,4],[29,5,30,5],[29,6,30,6],[14,7,16,7],[15,0,16,0]]}
["LAPORAN REKAPITULASI SISWA"]
[{"$f":"+MENU!$D$8","v":"SMA NEGERI 5 CILEGON"}]
[{"$f":"+MENU!$C$7","v":"TAHUN AJARAN"},null,null,null,null,{"$f":"+MENU!$D$7","v":"2013-2014"}]
[]
["ROMBEL","KELAS","Laki-laki","Perempuan","Jmlh Total / Rombel","Jml Total/ Jurusan","Berdasar asal sekolah Siswa / Kelas"]
[null,null,null,null,null,null,"SMP","MTS","Total"]
[1,{"$f":"+'DataBase-XI'!$B$5","v":"XI IPA-1"},{"$f":"+'DataBase-XI'!$F$50","v":1},{"$f":"+'DataBase-XI'!$F$51","v":0},{"$f":"SUM(C7:D7)","v":1},{"$f":"SUM(E7:E8)","v":2},{"$f":"+'DataBase-XI'!$U$50","v":0},{"$f":"+'DataBase-XI'!$U$51","v":1},{"$f":"+'DataBase-XI'!$U$52","v":1}]
[2,{"$f":"+'DataBase-XI'!$B$62","v":"XI IPA-2"},{"$f":"+'DataBase-XI'!$F$107","v":1},{"$f":"+'DataBase-XI'!$F$108","v":0},1,null,{"$f":"+'DataBase-XI'!$U$107","v":0},{"$f":"+'DataBase-XI'!$U$108","v":0},{"$f":"+'DataBase-XI'!$U$109","v":0}]
[3,{"$f":"+'DataBase-XI'!$B$119","v":"XI IPA-3"},{"$f":"+'DataBase-XI'!$F$164","v":0},{"$f":"+'DataBase-XI'!$F$165","v":1},1,{"$f":"SUM(E9:E10)","v":2},{"$f":"+'DataBase-XI'!$U$164","v":0},{"$f":"+'DataBase-XI'!$U$165","v":0},{"$f":"+'DataBase-XI'!$U$166","v":0}]
[4,{"$f":"+'DataBase-XI'!$B$176","v":"XI IPS-1"},{"$f":"+'DataBase-XI'!$F$221","v":1},{"$f":"+'DataBase-XI'!$F$222","v":0},1,null,{"$f":"+'DataBase-XI'!$U$221","v":20},{"$f":"+'DataBase-XI'!$U$222","v":13},{"$f":"+'DataBase-XI'!$U$223","v":33}]
[5,{"$f":"+'DataBase-XI'!$B$233","v":"XI IPS-2"},{"$f":"+'DataBase-XI'!$F$278","v":0},{"$f":"+'DataBase-XI'!$F$279","v":1},1,{"$f":"SUM(E11:E12)","v":2},{"$f":"+'DataBase-XI'!$U$278","v":0},{"$f":"+'DataBase-XI'!$U$279","v":0},{"$f":"+'DataBase-XI'!$U$280","v":0}]
[6,{"$f":"+'DataBase-XI'!$B$290","v":"XI IPS-3"},{"$f":"+'DataBase-XI'!$F$335","v":1},{"$f":"+'DataBase-XI'!$F$336","v":0},1,null,{"$f":"+'DataBase-XI'!$U$335","v":0},{"$f":"+'DataBase-XI'!$U$336","v":0},{"$f":"+'DataBase-XI'!$U$337","v":0}]
["JUMLAH",null,{"$f":"SUM(C7:C12)","v":4},2,6,6,20,14,34,null,"Siswa Menurut Jenis Kelamin dan kelompok Umur"]
[]
["Siswa Menurut Jenis Kelamin dan kelompok Umur",null,null,null,null,null,null,"Total"]
["Umur",{"$f":"+$B$7","v":"XI IPA-1"},{"$f":"+$B$8","v":"XI IPA-2"},{"$f":"+$B$9","v":"XI IPA-3"},{"$f":"+$B$10","v":"XI IPS-1"},{"$f":"+$B$11","v":"XI IPS-2"},{"$f":"+$B$12","v":"XI IPS-3"},null,null,null,"Umur","L","P","JML"]
[]
["14 tahun",{"$f":"+'DataBase-XI'!K50","v":0},{"$f":"+'DataBase-XI'!K107","v":0},{"$f":"+'DataBase-XI'!K164","v":0},{"$f":"+'DataBase-XI'!K221","v":0},{"$f":"+'DataBase-XI'!K278","v":0},{"$f":"+'DataBase-XI'!K335","v":0},{"$f":"SUM(B18:G18)","v":0},null,null,"13 tahun",{"$f":"+'DataBase-XI'!M414","v":0},{"$f":"+'DataBase-XI'!M415","v":0},{"$f":"SUM(L18:M18)","v":0}]
["15 tahun",{"$f":"+'DataBase-XI'!K51","v":0},{"$f":"+'DataBase-XI'!K108","v":0},{"$f":"+'DataBase-XI'!K165","v":0},{"$f":"+'DataBase-XI'!K222","v":0},{"$f":"+'DataBase-XI'!K279","v":1},{"$f":"+'DataBase-XI'!K336","v":0},1,null,null,"14 tahun",{"$f":"+'DataBase-XI'!M416","v":0},{"$f":"+'DataBase-XI'!M417","v":0},{"$f":"SUM(L19:M19)","v":0}]
["16 tahun",{"$f":"+'DataBase-XI'!K52","v":1},{"$f":"+'DataBase-XI'!K109","v":1},{"$f":"+'DataBase-XI'!K166","v":0},{"$f":"+'DataBase-XI'!K223","v":1},{"$f":"+'DataBase-XI'!K280","v":0},{"$f":"+'DataBase-XI'!K337","v":1},4,null,null,"15 tahun",{"$f":"+'DataBase-XI'!M418","v":1},{"$f":"+'DataBase-XI'!M419","v":0},1]
["17 tahun",{"$f":"+'DataBase-XI'!K53","v":0},{"$f":"+'DataBase-XI'!K110","v":0},{"$f":"+'DataBase-XI'!K167","v":1},{"$f":"+'DataBase-XI'!K224","v":0},{"$f":"+'DataBase-XI'!K281","v":0},{"$f":"+'DataBase-XI'!K338","v":0},1,null,null,"16 tahun",{"$f":"+'DataBase-XI'!M420","v":0},{"$f":"+'DataBase-XI'!M421","v":4},4]
["18 tahun",{"$f":"+'DataBase-XI'!K54","v":0},{"$f":"+'DataBase-XI'!K111","v":0},{"$f":"+'DataBase-XI'!K168","v":0},{"$f":"+'DataBase-XI'!K225","v":0},{"$f":"+'DataBase-XI'!K282","v":0},{"$f":"+'DataBase-XI'!K339","v":0},0,null,null,"17 tahun",{"$f":"+'DataBase-XI'!M422","v":1},{"$f":"+'DataBase-XI'!M423","v":0},1]
["19 tahun",{"$f":"+'DataBase-XI'!K55","v":0},{"$f":"+'DataBase-XI'!K112","v":0},{"$f":"+'DataBase-XI'!K169","v":0},{"$f":"+'DataBase-XI'!K226","v":0},{"$f":"+'DataBase-XI'!K283","v":0},{"$f":"+'DataBase-XI'!K340","v":0},0,null,null,"18 tahun",{"$f":"+'DataBase-XI'!M424","v":0},{"$f":"+'DataBase-XI'!M425","v":0},0]
["20 tahun",{"$f":"+'DataBase-XI'!K56","v":0},{"$f":"+'DataBase-XI'!K113","v":0},{"$f":"+'DataBase-XI'!K170","v":0},{"$f":"+'DataBase-XI'!K227","v":0},{"$f":"+'DataBase-XI'!K284","v":0},{"$f":"+'DataBase-XI'!K341","v":0},0,null,null,"19 tahun",{"$f":"+'DataBase-XI'!M426","v":0},{"$f":"+'DataBase-XI'!M427","v":0},0]
["21 tahun",null,null,null,null,null,null,null,null,null,"20 tahun",{"$f":"+'DataBase-XI'!M428","v":0},{"$f":"+'DataBase-XI'!M429","v":0},0]
[">= 22 tahun",null,null,null,null,null,null,null,null,null,"21 tahun",{"$f":"+'DataBase-XI'!M430","v":0},{"$f":"+'DataBase-XI'!M431","v":0},0]
["Jumlah 2)",{"$f":"SUM(B18:B26)","v":1},1,1,1,1,1,6,null,null,"22 tahun",{"$f":"+'DataBase-XI'!M432","v":0},{"$f":"+'DataBase-XI'!M433","v":0},0]
[]
["Siswa  berdasarkan Agama",null,null,null,null,null,null,"Total",null,null,"TOTAL",{"$f":"SUM(L18:L28)","v":2},{"$f":"SUM(M18:M28)","v":4},{"$f":"SUM(L29:M29)","v":6}]
["Agama",{"$f":"+$B$7","v":"XI IPA-1"},{"$f":"+$B$8","v":"XI IPA-2"},{"$f":"+$B$9","v":"XI IPA-3"},{"$f":"+$B$10","v":"XI IPS-1"},{"$f":"+$B$11","v":"XI IPS-2"},{"$f":"+$B$12","v":"XI IPS-3"}]
[]
["Islam",{"$f":"+'DataBase-XI'!W50","v":1},{"$f":"+'DataBase-XI'!W107","v":0},{"$f":"+'DataBase-XI'!W164","v":0},{"$f":"+'DataBase-XI'!W221","v":33},{"$f":"+'DataBase-XI'!W278","v":0},{"$f":"+'DataBase-XI'!W335","v":0},{"$f":"SUM(B32:G32)","v":34}]
["Katolik",{"$f":"+'DataBase-XI'!W51","v":0},{"$f":"+'DataBase-XI'!W108","v":0},{"$f":"+'DataBase-XI'!W165","v":0},{"$f":"+'DataBase-XI'!W222","v":0},{"$f":"+'DataBase-XI'!W279","v":0},{"$f":"+'DataBase-XI'!W336","v":0},{"$f":"SUM(B33:G33)","v":0}]
["Protestan",{"$f":"+'DataBase-XI'!W52","v":0},{"$f":"+'DataBase-XI'!W109","v":0},{"$f":"+'DataBase-XI'!W166","v":0},{"$f":"+'DataBase-XI'!W223","v":0},{"$f":"+'DataBase-XI'!W280","v":0},{"$f":"+'DataBase-XI'!W337","v":0},{"$f":"SUM(B34:G34)","v":0}]
["Hindu",{"$f":"+'DataBase-XI'!W53","v":0},{"$f":"+'DataBase-XI'!W110","v":0},{"$f":"+'DataBase-XI'!W167","v":0},{"$f":"+'DataBase-XI'!W224","v":0},{"$f":"+'DataBase-XI'!W281","v":0},{"$f":"+'DataBase-XI'!W338","v":0},{"$f":"SUM(B35:G35)","v":0}]
["Budha",{"$f":"+'DataBase-XI'!W54","v":0},{"$f":"+'DataBase-XI'!W111","v":0},{"$f":"+'DataBase-XI'!W168","v":0},{"$f":"+'DataBase-XI'!W225","v":0},{"$f":"+'DataBase-XI'!W282","v":0},{"$f":"+'DataBase-XI'!W339","v":0},{"$f":"SUM(B36:G36)","v":0}]
[]
[null,{"$f":"SUM(B32:B36)","v":1},0,0,33,0,0,34]
[]
[null,null,null,null,null,{"$f":"CONCATENATE(MENU!$D$13,\" ,   \",K40)","v":"Cilegon ,   24 Juli 2013"},null,null,null,null,{"$f":"TEXT(NOW(),\"dd mmmm yyyy\")","v":"24 Juli 2013"}]
[null,null,null,null,null,"Kepala Sekolah"]
[]
[]
[]
[]
[]
[null,null,null,null,null,{"$f":"+MENU!$D$9","v":"Asep Mansur, M.Pd"}]
[null,null,null,null,null,"Pembina"]
[null,null,null,null,null,{"$f":"+MENU!$D$10","v":"NIP. 19620101 198512 1 004"}]

{"sheet":"Jml_XII","index":17,"n_rows":49,"n_cols":14,"rows_kept":49,"cut":false,"hidden":false,"merged":[[28,17,29,17],[28,16,29,16],[28,10,29,10],[12,10,14,13],[28,22,29,22],[28,21,29,21],[28,20,29,20],[28,19,29,19],[28,18,29,18],[28,15,29,15],[28,14,29,14],[28,13,29,13],[28,12,29,12],[28,11,29,11],[15,21,15,22],[15,19,15,20],[15,17,15,18],[15,15,15,16],[15,10,16,10],[15,11,16,11],[15,12,16,12],[15,13,16,13],[36,0,36,7],[15,4,16,4],[15,5,16,5],[15,6,16,6],[25,1,25,7],[28,0,28,6],[28,7,30,7],[29,0,30,0],[29,1,30,1],[29,2,30,2],[29,3,30,3],[14,7,16,7],[15,0,16,0],[12,0,12,1],[14,0,14,6],[29,4,30,4],[29,5,30,5],[29,6,30,6],[15,1,16,1],[15,2,16,2],[15,3,16,3],[6,5,7,5],[8,5,9,5],[10,5,11,5],[0,0,0,8],[1,0,1,8],[2,0,2,4],[4,0,5,0],[4,1,5,1],[4,2,5,2],[4,3,5,3],[4,4,5,4],[4,5,5,5],[4,6,4,8]]}
["LAPORAN REKAPITULASI SISWA"]
[{"$f":"+MENU!$D$8","v":"SMA NEGERI 5 CILEGON"}]
[{"$f":"+MENU!$C$7","v":"TAHUN AJARAN"},null,null,null,null,{"$f":"+MENU!$D$7","v":"2013-2014"}]
[]
["ROMBEL","KELAS","Laki-laki","Perempuan","Jmlh Total / Rombel","Jml Total/ Jurusan","Berdasar asal sekolah Siswa / Kelas"]
[null,null,null,null,null,null,"SMP","MTS","Total"]
[1,{"$f":"+'DataBase-XII'!$B$5","v":"XII IPA-1"},{"$f":"+'DataBase-XII'!$F$50","v":0},{"$f":"+'DataBase-XII'!$F$51","v":1},{"$f":"SUM(C7:D7)","v":1},{"$f":"SUM(E7:E8)","v":2},{"$f":"+'DataBase-XII'!$U$50","v":0},{"$f":"+'DataBase-XII'!$U$51","v":1},{"$f":"SUM(G7:H7)","v":1}]
[2,{"$f":"+'DataBase-XII'!$B$62","v":"XII IPA-2"},{"$f":"+'DataBase-XII'!$F$107","v":0},{"$f":"+'DataBase-XII'!$F$108","v":1},1,null,{"$f":"+'DataBase-XII'!$U$107","v":1},{"$f":"+'DataBase-XII'!$U$108","v":0},1]
[3,{"$f":"+'DataBase-XII'!$B$119","v":"XII IPA-3"},{"$f":"+'DataBase-XII'!$F$164","v":1},{"$f":"+'DataBase-XII'!$F$165","v":0},1,{"$f":"SUM(E9:E10)","v":2},{"$f":"+'DataBase-XII'!$U$164","v":1},{"$f":"+'DataBase-XII'!$U$165","v":0},1]
[4,{"$f":"+'DataBase-XII'!$B$176","v":"XII IPS-1"},{"$f":"+'DataBase-XII'!$F$221","v":1},{"$f":"+'DataBase-XII'!$F$222","v":0},1,null,{"$f":"+'DataBase-XII'!$U$221","v":1},{"$f":"+'DataBase-XII'!$U$222","v":0},1]
[5,{"$f":"+'DataBase-XII'!$B$233","v":"XII IPS-2"},{"$f":"+'DataBase-XII'!$F$278","v":1},{"$f":"+'DataBase-XII'!$F$279","v":0},1,{"$f":"SUM(E11:E12)","v":2},{"$f":"+'DataBase-XII'!$U$278","v":1},{"$f":"+'DataBase-XII'!$U$279","v":0},1]
[6,{"$f":"+'DataBase-XII'!$B$290","v":"XII IPS-3"},{"$f":"+'DataBase-XII'!$F$335","v":1},{"$f":"+'DataBase-XII'!$F$336","v":0},1,null,{"$f":"+'DataBase-XII'!$U$335","v":1},{"$f":"+'DataBase-XII'!$U$336","v":0},1]
["JUMLAH",null,{"$f":"SUM(C7:C12)","v":4},2,6,6,5,1,6,null,"Siswa Menurut Jenis Kelamin dan kelompok Umur"]
[]
["Siswa Menurut Jenis Kelamin dan kelompok Umur",null,null,null,null,null,null,"Total"]
["Umur",{"$f":"+$B$7","v":"XII IPA-1"},{"$f":"+$B$8","v":"XII IPA-2"},{"$f":"+$B$9","v":"XII IPA-3"},{"$f":"+$B$10","v":"XII IPS-1"},{"$f":"+$B$11","v":"XII IPS-2"},{"$f":"+$B$12","v":"XII IPS-3"},null,null,null,"Umur","L","P","JML"]
[]
["14 tahun",{"$f":"+'DataBase-XII'!K50","v":0},{"$f":"+'DataBase-XII'!K107","v":0},{"$f":"+'DataBase-XII'!K164","v":0},{"$f":"+'DataBase-XII'!K221","v":0},{"$f":"+'DataBase-XII'!K278","v":0},{"$f":"+'DataBase-XII'!K335","v":0},{"$f":"SUM(B18:G18)","v":0},null,null,"13 tahun",{"$f":"+'DataBase-XII'!M414","v":0},{"$f":"+'DataBase-XII'!M415","v":0},{"$f":"SUM(L18:M18)","v":0}]
["15 tahun",{"$f":"+'DataBase-XII'!K51","v":0},{"$f":"+'DataBase-XII'!K108","v":0},{"$f":"+'DataBase-XII'!K165","v":0},{"$f":"+'DataBase-XII'!K222","v":0},{"$f":"+'DataBase-XII'!K279","v":0},{"$f":"+'DataBase-XII'!K336","v":0},0,null,null,"14 tahun",{"$f":"+'DataBase-XII'!M416","v":0},{"$f":"+'DataBase-XII'!M417","v":0},{"$f":"SUM(L19:M19)","v":0}]
["16 tahun",{"$f":"+'DataBase-XII'!K52","v":0},{"$f":"+'DataBase-XII'!K109","v":0},{"$f":"+'DataBase-XII'!K166","v":0},{"$f":"+'DataBase-XII'!K223","v":1},{"$f":"+'DataBase-XII'!K280","v":0},{"$f":"+'DataBase-XII'!K337","v":0},1,null,null,"15 tahun",{"$f":"+'DataBase-XII'!M418","v":0},{"$f":"+'DataBase-XII'!M419","v":0},0]
["17 tahun",{"$f":"+'DataBase-XII'!K53","v":1},{"$f":"+'DataBase-XII'!K110","v":1},{"$f":"+'DataBase-XII'!K167","v":1},{"$f":"+'DataBase-XII'!K224","v":0},{"$f":"+'DataBase-XII'!K281","v":0},{"$f":"+'DataBase-XII'!K338","v":1},4,null,null,"16 tahun",{"$f":"+'DataBase-XII'!M420","v":0},{"$f":"+'DataBase-XII'!M421","v":1},1]
["18 tahun",{"$f":"+'DataBase-XII'!K54","v":0},{"$f":"+'DataBase-XII'!K111","v":0},{"$f":"+'DataBase-XII'!K168","v":0},{"$f":"+'DataBase-XII'!K225","v":0},{"$f":"+'DataBase-XII'!K282","v":1},{"$f":"+'DataBase-XII'!K339","v":0},1,null,null,"17 tahun",{"$f":"+'DataBase-XII'!M422","v":2},{"$f":"+'DataBase-XII'!M423","v":2},4]
["19 tahun",{"$f":"+'DataBase-XII'!K55","v":0},{"$f":"+'DataBase-XII'!K112","v":0},{"$f":"+'DataBase-XII'!K169","v":0},{"$f":"+'DataBase-XII'!K226","v":0},{"$f":"+'DataBase-XII'!K283","v":0},{"$f":"+'DataBase-XII'!K340","v":0},0,null,null,"18 tahun",{"$f":"+'DataBase-XII'!M424","v":0},{"$f":"+'DataBase-XII'!M425","v":1},1]
["20 tahun",{"$f":"+'DataBase-XII'!K56","v":0},{"$f":"+'DataBase-XII'!K113","v":0},{"$f":"+'DataBase-XII'!K170","v":0},{"$f":"+'DataBase-XII'!K227","v":0},{"$f":"+'DataBase-XII'!K284","v":0},{"$f":"+'DataBase-XII'!K341","v":0},0,null,null,"19 tahun",{"$f":"+'DataBase-XII'!M426","v":0},{"$f":"+'DataBase-XII'!M427","v":0},0]
["21 tahun",null,null,null,null,null,null,null,null,null,"20 tahun",{"$f":"+'DataBase-XII'!M428","v":0},{"$f":"+'DataBase-XII'!M429","v":0},0]
[">= 22 tahun",null,null,null,null,null,null,null,null,null,"21 tahun",{"$f":"+'DataBase-XII'!M430","v":0},{"$f":"+'DataBase-XII'!M431","v":0},0]
["Jumlah 2)",{"$f":"SUM(B18:B26)","v":1},1,1,1,1,1,6,null,null,"22 tahun",{"$f":"+'DataBase-XII'!M432","v":0},{"$f":"+'DataBase-XII'!M433","v":0},0]
[]
["Siswa  berdasarkan Agama",null,null,null,null,null,null,"Total",null,null,"TOTAL",{"$f":"SUM(L18:L28)","v":2},{"$f":"SUM(M18:M28)","v":4},{"$f":"SUM(L29:M29)","v":6}]
["Agama",{"$f":"+$B$7","v":"XII IPA-1"},{"$f":"+$B$8","v":"XII IPA-2"},{"$f":"+$B$9","v":"XII IPA-3"},{"$f":"+$B$10","v":"XII IPS-1"},{"$f":"+$B$11","v":"XII IPS-2"},{"$f":"+$B$12","v":"XII IPS-3"}]
[]
["Islam",{"$f":"+'DataBase-XII'!W50","v":1},{"$f":"+'DataBase-XII'!W107","v":1},{"$f":"+'DataBase-XII'!W164","v":1},{"$f":"+'DataBase-XII'!W221","v":1},{"$f":"+'DataBase-XII'!W278","v":1},{"$f":"+'DataBase-XII'!W335","v":1},{"$f":"SUM(B32:G32)","v":6}]
["Katolik",{"$f":"+'DataBase-XII'!W51","v":0},{"$f":"+'DataBase-XII'!W108","v":0},{"$f":"+'DataBase-XII'!W165","v":0},{"$f":"+'DataBase-XII'!W222","v":0},{"$f":"+'DataBase-XII'!W279","v":0},{"$f":"+'DataBase-XII'!W336","v":0},{"$f":"SUM(B33:G33)","v":0}]
["Protestan",{"$f":"+'DataBase-XII'!W52","v":0},{"$f":"+'DataBase-XII'!W109","v":0},{"$f":"+'DataBase-XII'!W166","v":0},{"$f":"+'DataBase-XII'!W223","v":0},{"$f":"+'DataBase-XII'!W280","v":0},{"$f":"+'DataBase-XII'!W337","v":0},{"$f":"SUM(B34:G34)","v":0}]
["Hindu",{"$f":"+'DataBase-XII'!W53","v":0},{"$f":"+'DataBase-XII'!W110","v":0},{"$f":"+'DataBase-XII'!W167","v":0},{"$f":"+'DataBase-XII'!W224","v":0},{"$f":"+'DataBase-XII'!W281","v":0},{"$f":"+'DataBase-XII'!W338","v":0},{"$f":"SUM(B35:G35)","v":0}]
["Budha",{"$f":"+'DataBase-XII'!W54","v":0},{"$f":"+'DataBase-XII'!W111","v":0},{"$f":"+'DataBase-XII'!W168","v":0},{"$f":"+'DataBase-XII'!W225","v":0},{"$f":"+'DataBase-XII'!W282","v":0},{"$f":"+'DataBase-XII'!W339","v":0},{"$f":"SUM(B36:G36)","v":0}]
[]
[null,{"$f":"SUM(B32:B36)","v":1},1,1,1,1,1,6]
[]
[null,null,null,null,null,{"$f":"CONCATENATE(MENU!$D$13,\" ,   \",K40)","v":"Cilegon ,   24 Juli 2013"},null,null,null,null,{"$f":"TEXT(NOW(),\"dd mmmm yyyy\")","v":"24 Juli 2013"}]
[null,null,null,null,null,"Kepala Sekolah"]
[]
[]
[]
[]
[]
[null,null,null,null,null,{"$f":"+MENU!$D$9","v":"Asep Mansur, M.Pd"}]
[null,null,null,null,null,"Pembina"]
[null,null,null,null,null,{"$f":"+MENU!$D$10","v":"NIP. 19620101 198512 1 004"}]

{"sheet":"Data Jml Siswa","index":18,"n_rows":72,"n_cols":16,"rows_kept":72,"cut":false,"hidden":false,"merged":[[55,0,56,0],[55,1,55,5],[55,6,56,6],[51,0,52,0],[51,1,52,1],[51,2,52,2],[51,3,52,3],[34,0,34,6],[36,6,37,6],[40,0,41,0],[40,3,41,3],[40,2,41,2],[40,1,41,1],[11,6,16,6],[12,11,13,11],[14,5,16,5],[17,5,19,5],[17,6,22,6],[17,11,18,11],[20,5,22,5],[31,0,31,1],[32,0,32,1],[31,2,31,3],[32,2,32,3],[11,5,13,5],[23,0,23,1],[25,0,26,0],[25,1,25,3],[29,0,29,4],[30,0,30,1],[30,2,30,3],[30,4,31,4],[0,0,0,6],[1,0,1,6],[5,5,10,5],[5,6,10,6],[8,11,10,11]]}
["LAPORAN REKAPITULASI SISWA"]
[{"$f":"+MENU!$D$8","v":"SMA NEGERI 5 CILEGON"}]
[null,null,{"$f":"+MENU!$C$7","v":"TAHUN AJARAN"},null,{"$f":"+MENU!$D$7","v":"2013-2014"}]
[]
["JUMLAH ROMBEL","KELAS","Laki-laki","Perempuan","Jml/ Rombel","Jml Total/ kls","Jml/ Kls"]
[1,{"$f":"+'DataBase-X'!$B$5","v":"X-1"},{"$f":"+Jml_X!C7","v":0},{"$f":"+Jml_X!D7","v":1},{"$f":"SUM(C6:D6)","v":1},{"$f":"SUM(E6:E11)","v":6},{"$f":"+F6","v":6}]
[2,{"$f":"+'DataBase-X'!$B$62","v":"X-2"},{"$f":"+Jml_X!C8","v":1},{"$f":"+Jml_X!D8","v":0},1]
[3,{"$f":"+'DataBase-X'!$B$119","v":"X-3"},{"$f":"+Jml_X!C9","v":0},{"$f":"+Jml_X!D9","v":1},1,null,null,null,"X"]
[4,{"$f":"+'DataBase-X'!$B$176","v":"X-4"},{"$f":"+Jml_X!C10","v":1},{"$f":"+Jml_X!D10","v":0},1,null,null,null,"L","P","Jml: L + P",null,null,"TOTAL BERDASAR KELAMIN"]
[5,{"$f":"+'DataBase-X'!$B$233","v":"X-5"},{"$f":"+Jml_X!C11","v":1},{"$f":"+Jml_X!D11","v":0},1]
[6,{"$f":"+'DataBase-X'!$B$290","v":"X-6"},{"$f":"+Jml_X!C12","v":1},{"$f":"+Jml_X!D12","v":0},1,null,null,null,{"$f":"+C6+C7+C8+C9+C11+C10","v":4},{"$f":"+D6+D7+D8+D9+D11+D10","v":2},{"$f":"SUM(I11:J11)","v":6},null,null,"L","P"]
[7,{"$f":"+'DataBase-XI'!$B$5","v":"XI IPA-1"},{"$f":"+Jml_XI!C7","v":1},{"$f":"+Jml_XI!D7","v":0},1,{"$f":"SUM(E12:E14)","v":3},{"$f":"+F12+F15","v":6},null,"L","P",null,null,null,{"$f":"+I11+I13+I14+I18+I19","v":12},{"$f":"+J11+J13+J14+J18+J19","v":6},{"$f":"+N12+O12","v":18}]
[8,{"$f":"+'DataBase-XI'!$B$62","v":"XI IPA-2"},{"$f":"+Jml_XI!C8","v":1},{"$f":"+Jml_XI!D8","v":0},1,null,null,"XI A",{"$f":"+C12+C13+C14","v":2},{"$f":"+D12+D13+D14","v":1},{"$f":"SUM(I13:J13)","v":3},{"$f":"+K13+K14","v":6}]
[9,{"$f":"+'DataBase-XI'!$B$119","v":"XI IPA-3"},{"$f":"+Jml_XI!C9","v":0},{"$f":"+Jml_XI!D9","v":1},1,null,null,"XI S",{"$f":"+C17+C15+C16","v":2},{"$f":"+D15+D17+D16","v":1},{"$f":"SUM(I14:J14)","v":3}]
[10,{"$f":"+'DataBase-XI'!$B$176","v":"XI IPS-1"},{"$f":"+Jml_XI!C10","v":1},{"$f":"+Jml_XI!D10","v":0},1,{"$f":"SUM(E15:E17)","v":3},null,null,{"$f":"SUM(I13:I14)","v":4},{"$f":"SUM(J13:J14)","v":2}]
[11,{"$f":"+'DataBase-XI'!$B$233","v":"XI IPS-2"},{"$f":"+Jml_XI!C11","v":0},{"$f":"+Jml_XI!D11","v":1},1]
[12,{"$f":"+'DataBase-XI'!$B$290","v":"XI IPS-3"},{"$f":"+Jml_XI!C12","v":1},{"$f":"+Jml_XI!D12","v":0},1,null,null,null,"L","P"]
[13,{"$f":"+'DataBase-XII'!$B$5","v":"XII IPA-1"},{"$f":"+Jml_XII!C7","v":0},{"$f":"+Jml_XII!D7","v":1},1,{"$f":"SUM(E18:E20)","v":3},{"$f":"+F18+F21","v":6},"XII A",{"$f":"SUM(C18:C20)","v":1},{"$f":"SUM(D18:D20)","v":2},{"$f":"+I18+J18","v":3},{"$f":"+K18+K19","v":6}]
[14,{"$f":"+'DataBase-XII'!$B$62","v":"XII IPA-2"},{"$f":"+Jml_XII!C8","v":0},{"$f":"+Jml_XII!D8","v":1},1,null,null,"XII S",{"$f":"SUM(C21:C23)","v":3},{"$f":"SUM(D21:D23)","v":0},{"$f":"+I19+J19","v":3}]
[15,{"$f":"+'DataBase-XII'!$B$119","v":"XII IPA-3"},{"$f":"+Jml_XII!C9","v":1},{"$f":"+Jml_XII!D9","v":0},1,null,null,null,{"$f":"SUM(I18:I19)","v":4},{"$f":"SUM(J18:J19)","v":2}]
[16,{"$f":"+'DataBase-XII'!$B$176","v":"XII IPS-1"},{"$f":"+Jml_XII!C10","v":1},{"$f":"+Jml_XII!D10","v":0},1,{"$f":"SUM(E21:E23)","v":3},null,null,"L","P"]
[17,{"$f":"+'DataBase-XII'!$B$233","v":"XII IPS-2"},{"$f":"+Jml_XII!C11","v":1},{"$f":"+Jml_XII!D11","v":0},1,null,null,null,{"$f":"+I11+I15+I20","v":12},{"$f":"+J11+J15+J20","v":6},{"$f":"+J22+I22","v":18}]
[18,{"$f":"+'DataBase-XII'!$B$290","v":"XII IPS-3"},{"$f":"+Jml_XII!C12","v":1},{"$f":"+Jml_XII!D12","v":0},1]
["JUMLAH",null,{"$f":"SUM(C6:C22)","v":11},{"$f":"SUM(D6:D22)","v":6},{"$f":"SUM(E6:E22)","v":17},{"$f":"SUM(F6:F23)","v":18},{"$f":"SUM(G6:G23)","v":18},null,null,null,null,{"$f":"+K11+L13+L18","v":18}]
[]
["PSB- Kelas X","Target Penerimaan Pendaftar"]
[null,"L","P","L+P"]
[{"$f":"+G6","v":6},{"$f":"+I11","v":4},{"$f":"+J11","v":2},{"$f":"+B28+C28","v":6}]
[]
["Siswa Baru berdasarkan Jenis Kelamin"]
["SMP",null,"MTs",null,"SMP + MTs"]
[]
[{"$f":"+Jml_X!G13","v":0},null,{"$f":"+Jml_X!H13","v":0},null,{"$f":"+A33+B33+C33+D33","v":0},{"$f":"+A33+C33","v":0},{"$f":"+D33+B33","v":0},{"$f":"+G33+F33","v":0}]
[]
["Siswa Baru berdasarkan Usia"]
["L/P","14 Th","15 Th","16 Th",">=17 Th","SMP + MTs","L+P"]
["L",null,null,null,null,{"$f":"SUM(B37:E37)","v":0},{"$f":"+F37+F38","v":0}]
["P",null,null,null,null,{"$f":"SUM(B38:E38)","v":0}]
[]
["Siswa Menurut Jenis Kelamin dan kelompok Umur"]
["Umur","Kelas X","Kelas XI","Kelas XII"]
[]
["14 tahun",{"$f":"+Jml_X!B19+Jml_X!C19+Jml_X!D19+Jml_X!E19+Jml_X!F19+Jml_X!G19","v":3},{"$f":"+Jml_XI!B18+Jml_XI!C18+Jml_XI!D18+Jml_XI!E18+Jml_XI!F18+Jml_XI!G18","v":0},{"$f":"+Jml_XII!B18+Jml_XII!C18+Jml_XII!D18+Jml_XII!E18+Jml_XII!F18+Jml_XII!G18","v":0}]
["15 tahun",{"$f":"+Jml_X!B20+Jml_X!C20+Jml_X!D20+Jml_X!E20+Jml_X!F20+Jml_X!G20","v":3},{"$f":"+Jml_XI!B19+Jml_XI!C19+Jml_XI!D19+Jml_XI!E19+Jml_XI!F19+Jml_XI!G19","v":1},{"$f":"+Jml_XII!B19+Jml_XII!C19+Jml_XII!D19+Jml_XII!E19+Jml_XII!F19+Jml_XII!G19","v":0}]
["16 tahun",{"$f":"+Jml_X!B21+Jml_X!C21+Jml_X!D21+Jml_X!E21+Jml_X!F21+Jml_X!G21","v":0},{"$f":"+Jml_XI!B20+Jml_XI!C20+Jml_XI!D20+Jml_XI!E20+Jml_XI!F20+Jml_XI!G20","v":4},{"$f":"+Jml_XII!B20+Jml_XII!C20+Jml_XII!D20+Jml_XII!E20+Jml_XII!F20+Jml_XII!G20","v":1}]
["17 tahun",{"$f":"+Jml_X!B22+Jml_X!C22+Jml_X!D22+Jml_X!E22+Jml_X!F22+Jml_X!G22","v":0},{"$f":"+Jml_XI!B21+Jml_XI!C21+Jml_XI!D21+Jml_XI!E21+Jml_XI!F21+Jml_XI!G21","v":1},{"$f":"+Jml_XII!B21+Jml_XII!C21+Jml_XII!D21+Jml_XII!E21+Jml_XII!F21+Jml_XII!G21","v":4}]
["18 tahun",{"$f":"+Jml_X!B23+Jml_X!C23+Jml_X!D23+Jml_X!E23+Jml_X!F23+Jml_X!G23","v":0},{"$f":"+Jml_XI!B22+Jml_XI!C22+Jml_XI!D22+Jml_XI!E22+Jml_XI!F22+Jml_XI!G22","v":0},{"$f":"+Jml_XII!B22+Jml_XII!C22+Jml_XII!D22+Jml_XII!E22+Jml_XII!F22+Jml_XII!G22","v":1}]
["19 tahun",{"$f":"+Jml_X!B18+Jml_X!C18+Jml_X!D18+Jml_X!E18+Jml_X!F18+Jml_X!G18","v":0},{"$f":"+Jml_XI!B23+Jml_XI!C23+Jml_XI!D23+Jml_XI!E23+Jml_XI!F23+Jml_XI!G23","v":0},{"$f":"+Jml_XII!B23+Jml_XII!C23+Jml_XII!D23+Jml_XII!E23+Jml_XII!F23+Jml_XII!G23","v":0}]
["20 tahun",{"$f":"+Jml_X!B25+Jml_X!C25+Jml_X!D25+Jml_X!E25+Jml_X!F25+Jml_X!G25","v":0},{"$f":"+Jml_XI!B24+Jml_XI!C24+Jml_XI!D24+Jml_XI!E24+Jml_XI!F24+Jml_XI!G24","v":0},{"$f":"+Jml_XII!B24+Jml_XII!C24+Jml_XII!D24+Jml_XII!E24+Jml_XII!F24+Jml_XII!G24","v":0}]
["21 tahun"]
[">= 22 tahun"]
["Jumlah 2)",{"$f":"SUM(B43:B51)","v":6},{"$f":"SUM(C43:C51)","v":6},{"$f":"SUM(D43:D51)","v":6}]
[null,null,null,null,null,null,null,null,{"$f":"+B52+C52+D52&\" Siswa\"","v":"18 Siswa"}]
[]
[]
["Kelas","Siswa  berdasarkan Agama",null,null,null,null,"Total"]
[null,"Islam","Katholik","Protestan","Hindu","Budha"]
["X",{"$f":"+Jml_X!H32","v":0},{"$f":"+Jml_X!H33","v":0},{"$f":"+Jml_X!H34","v":0},{"$f":"+Jml_X!H35","v":0},{"$f":"+Jml_X!H36","v":0},{"$f":"SUM(B58:F58)","v":0}]
["XI",{"$f":"+Jml_XI!H32","v":34},{"$f":"+Jml_XI!H33","v":0},{"$f":"+Jml_XI!H34","v":0},{"$f":"+Jml_XI!H35","v":0},{"$f":"+Jml_XI!H36","v":0},{"$f":"SUM(B59:F59)","v":34}]
["XII",{"$f":"+Jml_XII!H32","v":6},{"$f":"+Jml_XII!H33","v":0},{"$f":"+Jml_XII!H34","v":0},{"$f":"+Jml_XII!H35","v":0},{"$f":"+Jml_XII!H36","v":0},{"$f":"SUM(B60:F60)","v":6}]
[null,{"$f":"SUM(B58:B60)","v":40},0,0,0,0,40]
[]
["Mengetahui ",null,null,null,null,{"$f":"CONCATENATE(MENU!$D$13,\" ,   \",K63)","v":"Cilegon ,   24 Juli 2013"},null,null,null,null,{"$f":"TEXT(NOW(),\"dd mmmm yyyy\")","v":"24 Juli 2013"}]
["Kepala Sekolah",null,null,null,null,"Waka Kurikulum"]
[]
[]
[]
[]
[]
[{"$f":"+MENU!$D$9","v":"Asep Mansur, M.Pd"},null,null,null,null,{"$f":"+MENU!$D$11","v":"Nur Badriyah,S.Pd"}]
["Pembina"]
[{"$f":"+MENU!$D$10","v":"NIP. 19620101 198512 1 004"},null,null,null,null,{"$f":"+MENU!$D$12","v":"NIP: 19740217 200604 2 002"}]

{"sheet":"MASUK","index":19,"n_rows":10,"n_cols":26,"rows_kept":10,"cut":false,"hidden":false,"merged":[[2,8,3,9],[2,22,3,22],[2,5,3,5],[2,23,2,25],[2,15,3,15],[2,14,3,14],[2,13,3,13],[2,12,3,12],[0,0,0,13],[2,0,3,0],[2,21,3,21],[2,20,3,20],[2,19,3,19],[2,18,3,18],[2,17,3,17],[2,16,3,16],[2,7,3,7],[2,6,3,6],[2,1,3,1],[2,4,3,4],[2,3,3,3],[2,2,3,2],[2,11,3,11],[2,10,3,10]]}
["DATA MUTASI SISWA PINDAHAN MASUK ( M-1 )"]
[]
["NO","KELAS","NAMA","NIS","NISN","L/P","TMPT LHR","TGL LAHIR","Val",null,"Usia ","NAMA ORANG TUA","PENDAPATAN ORANG TUA","PEKERJAAN ORANG TUA","ALAMAT","NO STTB","NO SKHU","NO PESERTA UJIAN SMP","ASAL SEKOLAH","THN LULUS","SMP/ MTs","NO TELP/HP","AGAMA","ASAL SEKOLAH"]
[null,null,null,null,null,null,null,null,null,null,null,null,null,null,null,null,null,null,null,null,null,null,null,"ASAL SEKOLAH","TGL MASUK","MASUK KE KELAS"]
[1,"XII-IPA-1","FAJAR PAMBUDI",13140602,"9961743685","L","SERANG","1996-05-12",1995,2013,{"$f":"+J5-I5","v":18},"AGUS WINARTO","Rp 1.000.000 - 1.500.000 Ribu","WIRASWASTA","PERUM CIBEBER BLOK E2 No:1","DN-30 DI 0027972","DN-30 DI 28833591","2-11-30-03-003-148-5","SMPN 3 CILEGON",2011,"SMP","087880260251","Islam","SMAN 1 SERANG","2013-07-16",{"$f":"+B5","v":"XII-IPA-1"}]
[2,"XII-IPS-2","DEA ALIF UTAMA",1314604,"9960473474","L","SERANG","1996-01-31",1996,{"$f":"+$J$5","v":2013},17,"DENNY INSAN MUTAQIN","Rp 1.000.000 - 1.500.000 Ribu","KARY/ PEGAWAI .BUMN","JL.ANGGREK NO ;5 BBS II CIWEDUS","DN-30 DI 0028412","DN-30 DI 2834033","2-11-30-03-006-087-2","SMPN 5 CILEGON",2011,"SMP","081311459194","Islam","SMAN 3 CILEGON","2013-07-16","XII-IPS-2"]
[3,"XII-IPS-3","ULYA FIRDAUS",1314603,"9962202459","L","SERANG","1996-02-20",1996,{"$f":"+$J$5","v":2013},17,"MADURIT","Rp 2.000.000 -2500.000 Ribu","KARY/ PEGAWAI .BUMN","LINK.KLELET RT 01/03 KEL.WARNASARI ","MTS 280018384","MTS 300018385",null,"MTS DAREEL QOLAM",2011,"MTS","081213175656","Islam","SMAN 1 CILEGON","2013-07-16","XII-IPS-3"]
[4,"XI-IPA 3","SRI SUGIARTI",13140605,"9970456130","P","MAGETAN","1997-05-12",1997,{"$f":"+$J$5","v":2013},16,"SUMINGAN","Rp 1.000.000 - 1.500.000 Ribu","WIRASWASTA","KP.WARUNG JUET RT 01/02 SAMANGRAYA CITANGKIL 42413","MTS 280042745","DN-30 DI 0739446","2-12-30-03-057-060-5","MTS AL-KHAIRIYAH KUBANGSARI",2012,"MTs","087871767924","Islam","MAN CILEGON","2013-07-16","XI-IPA 3"]
[5,"XI-IPS 2","TIAS SEFTIANI MUTIAB",13140606,"9970454682","P","SERANG","1997-09-19",1997,{"$f":"+$J$5","v":2013},16,"AGUS DERAJAT","Rp 500 - 700 Ribu","BURUH HARIAN",null,"MTS 100118663","DN-30 DI 0134441","2-12-02-023-560-053-4","LAINNYA",2012,"MTs","087726985751","Islam","SMAN 1  JALANCAGAK SUBANG","2013-07-16","XI-IPS 2"]
[6,"XII-IPS-3","INTAN",13140607,null,"P",null,null,1996,{"$f":"+$J$5","v":2013},17,null,null,null,null,null,null,null,null,null,null,null,null,null,"2013-07-16","XII-IPS-3"]

{"sheet":"KELUAR","index":20,"n_rows":17,"n_cols":26,"rows_kept":17,"cut":false,"hidden":false,"merged":[[0,0,0,13],[2,0,3,0],[2,1,3,1],[2,2,3,2],[2,3,3,3],[2,4,3,4],[2,5,3,5],[2,6,3,6],[2,7,3,7],[2,8,3,9],[2,10,3,10],[2,11,3,11],[2,12,3,12],[2,13,3,13],[2,14,3,14],[2,15,3,15],[2,22,3,22],[2,23,2,25],[2,16,3,16],[2,17,3,17],[2,18,3,18],[2,19,3,19],[2,20,3,20],[2,21,3,21]]}
["DATA MUTASI SISWA KELUAR"]
[]
["NO","KELAS","NAMA","NIS","NISN","L/P","TMPT LHR","TGL LAHIR","Val",null,"Usia ","NAMA ORANG TUA","PENDAPATAN ORANG TUA","PEKERJAAN ORANG TUA","ALAMAT","NO STTB","NO SKHU","NO PESERTA UJIAN SMP","ASAL SEKOLAH","THN LULUS","SMP/ MTs","NO TELP/HP","AGAMA","ASAL SEKOLAH"]
[null,null,null,null,null,null,null,null,null,null,null,null,null,null,null,null,null,null,null,null,null,null,null,"SEKOLAH DITUJU","TGL KELUAR","MASUK KE KELAS"]
[1,"X-1","MUHAMMAD AZIZ AMRULLAH",12130021,"9965357738","L","CILEGON","1996-11-21",1996,2013,{"$f":"+J5-I5","v":17},"Samsudin hamid","Rp:1,500,000","WIRASWASTA","Jl.Hiu No:5 Kavling Blok C No 5 RT 002/006 Kec.Jombang","DN-30 DI 0029635","DN-30 DI 2804612","2-12-30-03-011-083-6","SMPN 7 CILEGON",2012,null,null,null,null,"2013-07-16",{"$f":"+B5","v":"X-1"}]
[2,"X-1","Edi Sukarya",12130009,"9970452091","L","CILEGON","1997-03-11",1996,{"$f":"+$J$5","v":2013},{"$f":"+J6-I6","v":17},"Saliman","Rp:1,500,000","TANPA DATA","Kp.Pangabuan Ciwandan",null,null,null,"SMPN 9 CILEGON",2012,null,null,null,null,"2013-07-16","X-1"]
[3,"X-3","Aditia Pravasta",12130071,null,"L",null,null,1995,2013,{"$f":"+J7-I7","v":18},null,null,null,null,null,null,null,"SMP Daar El Falaah",null,null,null,null,null,"2013-07-16","X-3"]
[4,"X-3","AHMAD MUSROFI",12130072,"9950476742","L","CILEGON","1995-10-26",1995,2013,18,"FAHRUDIN","Rp:2,500,000","WIRASWASTA","JlSunan Derajat Link.temugiring RT 14/01 Ciwandan Cilegon-42444","MTs 280042759","DN-30 DI 0739460","2-12-30-03-057-074-7","MTS AL-KHAIRIYAH KUBANGSARI",2012,null,null,null,null,"2013-07-16","X-3"]
[5,"X-3","ALIYANTO",12130075,"9970452395","L","SERANG","1997-11-18",1997,2013,16,"HUJAENI","Rp:1,500,000","WIRASWASTA","Jl.Sunan Bonang Link.Kebanjiran No;1 RT 1/2 Ciwandan Cilegon 42445","DN-30 DI 0028859","DN-30 DI 2803836","2-12-30-03-005-175-2","SMPN 4 CILEGON",2012,null,null,null,null,"2013-07-16","X-3"]
[6,"X-3","SUPENDI",12130102,"9955292393","L","CILEGON","1996-04-03",1996,2013,17,null,"Rp:1,500,000","TANPA DATA",null,null,null,null,"MTS ALKH-KRACAK",2012,null,null,null,null,"2013-07-16","X-3"]
[7,"X-3","NOVIA NINGSIH",12130093,"9965257461","P","CILEGON","1996-11-24",1996,2013,17,"SUPENDI","Rp:500-700 rb ","WIRASWASTA","Jl.Sunan Bonang Kp.Ciasem RT 10/04 Ds.Banjarnegara Ciwandan ","MTs 280042554","DN-30 DI 0739024","2-12-30-03-049-048-9","MTS ALKH-KRACAK",2012]
[8,"X-5","ARDEN ARDIANTO",12130141,"9970454612","L","SERANG","1997-07-07",1997,2013,16,"DEDI PURWANTO","Rp:3,500,000 Keatas","PEG.BUMN","Perum Warnasari FWA 38 C N0: 9","DN-30 DI 0028725","DN-30 DI 2803702","2-12-30-03-005-041-8","SMPN 4 CILEGON",2012]
[9,"X-5","MILKI MARISAH",12130158,"9960474065","P","SERANG","1996-12-15",1996,2013,17,"MOHAMMAD TOHA","Rp:1,500,000","PEDAGANG","Jl.H.Umar No 98 Temuputih CILEGON 42415","DN-30 DI 0029911","DN-30 DI 2804888","2-12-30-03-012-141-4","SMPN 8 CILEGON",2012]
[10,"X-5","MUCHAMAD FERDY",12130159,"9975213174","L","SERANG","1997-03-03",1997,2013,16,"MAD AFIF","Rp:3,500,000 Keatas","KARYAWAN","Jl.sunan Kalijaga No 106 Link.Gambiran",null,null,null,"SMP YPWKS",2012]
[11,"X-5","Osyen Aprilio",12130164,null,"L",null,null,1996,2013,17,null,"Rp:3,500,000 Keatas","TANPA DATA",null,null,null,null,"SMP AL-ISHLAH",2012]
[12,"XI-IPS 1","FAHRULLOH",1112125,"9940513352","L","CILEGON","1994-01-23",1994,2013,19,"REBUDIN","Rp:500-700 rb ","BURUH","JL. SUNAN BONANG LINK KEBANJIRAN","MTS-280046568","DN-30 DI 0739211","2-11-30-03-057-076-5","MTS AL-KH KB SARI",2011,"MTS"]
[13,"XI-IPS 2","MUHAMMAD ICHWANUDDIN PRADANA",1112037,null,"L","Serang","1996-04-02",1996,2013,17,"HABIBI AK",null,"TANPA DATA",null,"MTs 280044246","DN-30 DI 0737806","2-11-30-03-041-071-2","MTS AL INAYAH JERANG",2011,"MTS"]

{"sheet":"Pembinaan","index":21,"n_rows":39,"n_cols":9,"rows_kept":39,"cut":false,"hidden":false,"merged":[[0,0,0,8]]}
["CATATAN PEMBINAAN SISWA"]
[]
["No","Hari/Tanggal","Nama","L/P","Kelas","Kejadian /Masalah","penyelesaian dan Tindak Lanjut","Keterangan","Paraf"]
[]
[]
[]
[]
[]
[]
[]
[]
[]
[]
[]
[]
[]
[]
[]
[]
[]
[]
[]
[]
[]
[]
[]
[]
[]
[]
[]
[]
[]
[]
[]
[]
[]
["@"]
["<"]
[">"]

{"sheet":"Struktur Organigram","index":22,"n_rows":51,"n_cols":7,"rows_kept":51,"cut":false,"hidden":false,"merged":[[0,0,0,8],[1,0,1,8],[2,0,2,8],[4,2,4,6],[5,2,5,6],[8,2,8,6],[9,2,9,6],[12,2,12,6],[13,2,13,6],[14,2,14,6],[18,0,18,2],[18,6,18,8],[19,0,19,2],[19,6,19,8],[20,0,20,2],[20,6,20,8],[22,3,23,5],[27,0,27,2],[27,6,27,8],[33,1,33,3],[33,5,33,7],[34,1,34,3],[34,5,34,7],[28,0,28,2],[28,6,28,8],[29,0,29,2],[29,6,29,8],[32,1,32,3],[32,5,32,7]]}
["STRUKTUR ORGANIGRAM"]
["KELAS :................."]
[{"$f":"+MENU!$D$8","v":"SMA NEGERI 5 CILEGON"}]
[]
[null,null,"KEPALA SEKOLAH"]
[null,null,{"$f":"+[1]MENU!$C$16","v":"Asep Mansur,S.Pd"}]
[]
[]
[null,null,"WALI KELAS"]
[]
[]
[]
[null,null,"KETUA KELAS & WAKIL"]
[]
[]
[]
[]
[]
["SEKRETARIS",null,null,null,null,null,"BENDAHARA"]
[]
[]
[]
[null,null,null,"SEKSI-SEKSI"]
[]
[]
[]
[]
["KEBERSIHAN",null,null,null,null,null,"KEAMANAN"]
[]
[]
[]
[]
[null,"UPACARA",null,null,null,"KEROHANIAN"]
[]
[]
[]
[]
[]
[]
[]
[]
[]
[]
[]
[]
[]
[]
[]
["@"]
["<"]
[">"]

{"sheet":"Grafik-PSB","index":23,"n_rows":26,"n_cols":9,"rows_kept":26,"cut":false,"hidden":false,"merged":[[13,6,13,7],[14,0,14,7],[0,0,0,8],[2,0,3,0],[2,1,3,1],[2,2,2,3],[2,4,2,5],[2,6,2,7],[2,8,3,8],[16,1,17,1],[16,2,17,2],[13,0,13,1],[13,2,13,3],[13,4,13,5]]}
["DATA PENCAPAIAN DAN JUMLAH SISWA SMA NEGERI 5 CILEGON"]
[]
["NO","TAHUN","KELAS X",null,"KELAS XI",null,"KELAS XII",null,"JUMLAH TOTAL"]
[null,null,"PUTRA","PUTRI","PUTRA","PUTRI","PUTRA","PUTRI"]
[1,2,3,4,5,6,7,8,9]
[1,"2005-2006",23,23,null,null,null,null,{"$f":"+H6+G6+F6+E6+D6+C6","v":46}]
[2,"2006-2007",84,91,23,23,null,null,221]
[3,"2007-2008",69,109,84,91,23,23,399]
[4,"2008-2009",63,110,69,109,84,91,526]
[5,"2009-2010",85,122,58,105,62,110,542]
[6,"2010-2011",81,126,81,117,55,101,561]
[7,"2011-2012",66,124,78,124,74,113,579]
[8,"2012-2013",61,146,57,125,69,122,580]
["Jml thn terakhir",null,{"$f":"+C13+D13","v":207},null,{"$f":"+E13+F13","v":182},null,{"$f":"+G13+H13","v":191}]
["PENCAPAIAN TERTINGGI",null,null,null,null,null,null,null,{"$f":"MAX(I6:I13)","v":580}]
[]
[null,"TAHUN","JMLH SISWA"]
[]
[null,"2005-2006",{"$f":"+C6+D6","v":46}]
[null,"2006-2007",175]
[null,"2007-2008",178]
[null,"2008-2009",173]
[null,"2009-2010",207]
[null,"2010-2011",207]
[null,"2011-2012",190]
[null,"2012-2013",207]

{"sheet":"Denah Sekolah","index":24,"n_rows":36,"n_cols":18,"rows_kept":36,"cut":false,"hidden":false,"merged":[[0,1,0,17],[3,2,5,3],[3,4,5,4],[3,5,9,5],[3,6,5,6],[3,7,9,7],[3,8,9,8],[4,12,9,13],[4,14,9,15],[4,17,9,17],[6,2,9,2],[6,3,9,4],[6,6,9,6],[4,16,9,16],[10,17,15,17],[11,2,13,3],[12,5,24,10],[15,1,16,3],[16,12,23,12],[16,14,23,15],[17,1,20,3],[17,17,21,17],[21,1,24,3],[22,17,25,17],[36,10,37,10],[34,17,37,17],[35,5,35,10],[35,12,37,13],[35,14,37,14],[35,15,37,15],[36,5,37,5],[36,6,37,6],[36,7,37,7],[36,8,37,8],[36,9,37,9],[26,1,28,3],[26,12,30,12],[26,14,28,15],[26,17,29,17],[29,5,33,10],[30,17,33,17]]}
[null,"Jl. Sunan Bonang Link.Dukuh Kel.Banjarnegara"]
[]
[null,null,null,null,null,null,null,null,null,null,null,null,null,null,"UTARA"]
[null,null,"R.BP",null,"Ruang Kep.Sek","Ruang Piket",null,"PANITIA","GUDANG"]
[null,null,null,null,null,null,null,null,null,null,null,null,"KELAS XII-IPA 1",null,"KELAS XII-IPA 2",null,"KLS XII-IPA 3","KLS XI-IPS 3"]
[]
[null,null,"WC","Ruang TU",null,null,"Ruang Keuangan"]
[]
[]
[]
[null,null,null,null,null,null,null,null,null,null,null,null,null,null,null,null,null,"Ruang Lab IPA"]
["P=5  1/2",null,"Ruang Koperasi sekolah"]
["L=3,30",null,null,null,null,"LAPANGAN UPACARA DAN LAPANGAN OLAH RAGA"]
["T=3 m"]
[]
[null,"KLS XII-IPS 3"]
[null,null,null,null,null,null,null,null,null,null,null,null,"KELAS XI-IPA 1",null,"MASJID"]
[null,"KLS XII-IPS 2",null,null,null,null,null,null,null,null,null,null,null,null,null,null,null,"KLS XI-IPS 1"]
[]
[]
[]
[null,"KLS XII-IPS 1"]
[null,null,null,null,null,null,null,null,null,null,null,null,null,null,null,null,null,"KLS XI-IPS 2"]
[]
[]
[]
[null,"Toilet Siswa",null,null,null,null,null,null,null,null,null,null,"KLS XI-IPA 2",null,"KLS XI-IPA 3",null,null,"KLS X-1"]
[]
[]
[null,null,null,null,null,"PARKIR"]
[null,null,null,null,null,null,null,null,null,null,null,null,null,null,null,null,null,"KLS X-2"]
[]
[]
[]
[null,null,null,null,null,null,null,null,null,null,null,null,null,null,null,null,null,"KLS X-3"]
[null,null,null,null,null,"WARUNG",null,null,null,null,null,null,"KLS X-6",null,"X-5","X-4"]

{"sheet":"COVER","index":25,"n_rows":52,"n_cols":5,"rows_kept":52,"cut":false,"hidden":false,"merged":[[48,1,48,7],[49,1,49,7],[50,1,50,7],[51,1,51,7]]}
[]
[]
[]
[]
[]
[]
[]
[]
[]
[]
[]
[]
[]
[]
[]
[]
[]
[]
[]
[]
[]
[]
[]
[]
[]
[]
[]
[]
[]
[]
[]
[]
[]
[]
[]
[]
[]
[]
[]
[null,null,null,"KELAS",":"]
[]
[null,null,null,"NAMA",":…………………………………………."]
[null,null,null,"NIP",":…………………………………………."]
[]
[]
[]
[]
[]
[null,"PEMERINTAH KOTA CILEGON"]
[null,"DINAS PENDIDIKAN"]
[null,"SEKOLAH MENENGAH ATAS (SMA) NEGERI 5 CILEGON"]
[null,"JL. SUNAN BONANG KEL. BANJARNEGARA - CIWANDAN TELP. (0254) 7038786 CILEGON"]

{"sheet":"MOS","index":26,"n_rows":375,"n_cols":6,"rows_kept":375,"cut":false,"hidden":false,"merged":[[6,0,6,5],[65,0,65,5],[66,0,66,5],[67,0,67,5],[0,0,0,5],[1,0,1,5],[2,0,2,5],[4,0,5,0],[4,1,5,1],[4,2,5,2],[4,3,5,3],[69,0,70,0],[69,1,70,1],[69,2,70,2],[69,3,70,3],[71,0,71,5],[132,0,132,5],[191,0,191,5],[192,0,192,5],[193,0,193,5],[126,0,126,5],[127,0,127,5],[128,0,128,5],[130,0,131,0],[130,1,131,1],[130,2,131,2],[130,3,131,3],[195,0,196,0],[195,1,196,1],[195,2,196,2],[195,3,196,3],[197,0,197,5],[325,0,326,0],[325,1,326,1],[325,2,326,2],[325,3,326,3],[327,0,327,5],[325,4,326,5],[262,0,262,5],[321,0,321,5],[322,0,322,5],[323,0,323,5],[4,4,5,5],[260,4,261,5],[195,4,196,5],[130,4,131,5],[69,4,70,5],[256,0,256,5],[257,0,257,5],[258,0,258,5],[260,0,261,0],[260,1,261,1],[260,2,261,2],[260,3,261,3]]}
["DAFTAR HADIR SISWA/I PESERTA MOS"]
["SMA NEGERI 5 CILEGON"]
["TAHUN AJARAN 2013-2014"]
["RUANGAN",null,"X-1"]
["NO","NIS","NAMA","L/P","PARAF"]
[]
[]
[1,9980453708,"M. REYMOND AL-HADAD","L",1]
[2,9980450362,"ANISA ROSALIA","P",null,2]
[3,9985058272,"ERDA EVRINA","P",3]
[4,9975313682,"SRI MARYATI","P",null,4]
[5,9970456077,"FITRIYANAH","P",5]
[6,9985058212,"MAGFIROH","P",null,6]
[7,9980452315,"EKA AFRIYANA","P",7]
[8,9980452108,"HERLINA","P",null,8]
[9,9980453710,"M YUNUS","L",9]
[10,9980451561,"IFAN AGUS EFENDI","L",null,10]
[11,9985057867,"INDAH SYFA NABILA","P",11]
[12,99805403084,"INDAH KARTIKA SARI","P",null,12]
[13,9975157158,"INGGRID ARDHIANI","P",13]
[14,9980450815,"SRI ROMLAH","P",null,14]
[15,9980451885,"NOVIANTI NUR KHOLIFAH","P",15]
[16,9970456061,"ALVIRA","P",null,16]
[17,9985058170,"HUSNAYATI","P",17]
[18,9970452103,"MARYATI","P",null,18]
[19,9960459857,"LENI LARASWATI","P",19]
[20,9980451577,"RIFAL FISTOLANI","L",null,20]
[21,996579205,"NOVINDA EKA AJIYANI","P",21]
[22,9980451815,"NINA RAMADHANI","P",null,22]
[23,9980450316,"IMAS MASRUROH","P",23]
[24,9975156619,"NAFILAH","P",null,24]
[25,9980439880,"RIKA HASTRIA","P",25]
[26,9980453150,"KIKI NURMALASARI","P",null,26]
[27,9980439813,"RISMA DWIYANTI","P",27]
[28,9975214145,"LISKA NOVITA SARI","P",null,28]
[29,9985057585,"SANDRA PUTRI SYAFRIDA","P",29]
[30,"9985114383","ERAWATI","P",null,30]
[31,"9985114364","NIA NIMATUL MAULA","P",31]
[32,"9975213684","NOVIANDI","L",null,32]
[33,"9980451586","SETIAWAN RAMADHAN","L",33]
[34,"9985058166","RUSMAWATI","P",null,34]
[35,"9980451588","SISKA MUNAFA","P",35]
[36,9975213659,"MAFRUDOH","P",null,36]
[37,9980452294,"RIKA FIRNANDA","P",37]
[]
[null,null,"Jumlah Laki-laki",6,null,"Cilegon,…………………………….20"]
[null,null,"Jumlah Perempuan",31,null,"Guru Bidang Studi"]
[null,null,"Jumlah Total",37]
[]
[]
[]
[]
[]
[null,null,null,null,null,"(……………………...……….)"]
[null,null,null,null,null,"NIP:……………………………………."]
[]
[]
[]
[]
[]
[]
[]
[]
[]
[]
["DAFTAR HADIR SISWA/I PESERTA MOS"]
["SMA NEGERI 5 CILEGON"]
["TAHUN AJARAN 2013-2014"]
["RUANGAN",null,"X-2"]
["NO","NIS","NAMA","L/P","PARAF"]
[]
[]
[1,9985113826,"MORINGKA BAGUS C","L",1]
[2,9974819028,"ESTER INTAN","P",null,2]
[3,"9990399704","FIRDA SAFAYANTI","P",3]
[4,"9980450325","LIA SUCI RAMADHANTI","P",null,4]
[5,"9950474213","SITI FATIMAH","P",5]
[6,"9980450818","TIARA ARDHIYANTI","P",null,6]
[7,0,"DEA AYUNING TYAS","P",7]
[8,"9980450402","RIKA TRI RAHMADANI","P",null,8]
[9,9980450753,"ENDAH SOLIHATUN NIKMAH","P",9]
[10,9980451486,"MAISATUL ABDIYAH","P",null,10]
[11,9980453704,"KRIS WIDIYANTI","P",11]
[12,9980450204,"SHIFA SALSABILA UNANDI","P",null,12]
[13,9980453239,"FIRDA MAULANI","P",13]
[14,9985114087,"FARAH FERNAWATI","P",null,14]
[15,9980450193,"RAJA ANUGRAH E.D.M.P","L",15]
[16,9980450730,"ANNISA KURNIASIH","P",null,16]
[17,9980452321,"HALIMATUSSA'DIAH","P",17]
[18,"9980451582","RIZQY MUHAMMAD","L",null,18]
[19,"9980437782","AHMAD FAHYUMI","L",19]
[20,"9986233334","HERAWATI","P",null,20]
[21,"9980455130","DEVIANA ROSMADEWI","P",21]
[22,"9965357437","AMIATUN HASANAH","P",null,22]
[23,"9970452459","SITI ROHMAH","P",23]
[24,"9985114349","RINA NURHASANAH","P",null,24]
[25,"9985058222","ELI NURMAYANTI","P",25]
[26,"9970452418","IKROMAH","P",null,26]
[27,"9975213683","NURALIM","L",27]
[28,"9975156585","NURDIYANI","P",null,28]
[29,"9970456068","DIAH AYU PERMATASARI","P",29]
[30,"9980439819","SITI MUZDALIFAH","P",null,30]
[31,"9980451573","NISA USOLIHAH","P",31]
[32,"9970454218","FAUJAN ADIM","L",null,32]
[33,"9975156584","SUHEBI","L",33]
[34,9980450357,"ADITYA YUDISTIRA","L",null,34]
[35,9985058168,"ULFATUL JAHRO","P",35]
[36,9980439811,"ROZCHA TRISNA A","P",null,36]
[37,9985057732,"DAROJATUL GINA","L",37]
[]
[null,null,"Jumlah Laki-laki",9,null,"Cilegon,…………………………….20"]
[null,null,"Jumlah Perempuan",28,null,"Guru Bidang Studi"]
[null,null,"Jumlah Total",37]
[]
[]
[]
[null,null,null,null,null,"(……………………...……….)"]
[null,null,null,null,null,"NIP:……………………………………."]
[]
[]
[]
[]
[]
[]
[]
[]
["DAFTAR HADIR SISWA/I PESERTA MOS"]
["SMA NEGERI 5 CILEGON"]
["TAHUN AJARAN 2013-2014"]
["RUANGAN",null,"X-3"]
["NO","NIS","NAMA","L/P","PARAF"]
[]
[]
[1,9985114956,"TIO PAMUKTI","L",1]
[2,9980450295,"CHELSI BAYANG PRAHESTI","P",null,2]
[3,9980450354,"YUSPITA KHAERUNISA","P",3]
[4,9980451978,"ZSAHARA MELIANDINA","P",null,4]
[5,9990413553,"BELA AMELIA LESTARI","P",5]
[6,997045521,"HENDRIK BAYU ALVIAN","L",null,6]
[7,9985114366,"FAHIDIN","L",7]
[8,9985114351,"HUMROTUL HASANAH","P",null,8]
[9,9975154980,"SOFIAH","P",9]
[10,9980453275,"TIA SYAFIRA","P",null,10]
[11,9980523438,"PUTRI AGNESIA","P",11]
[12,9988413542,"ADE SRI JUA ASIH","P",null,12]
[13,9995213207,"FEBRI ARI PRATAMA","L",13]
[14,9990410838,"ZULFA NURUL KH","P",null,14]
[15,"9980451635","SIFA NUR FAJRIYAH","P",15]
[16,"9975155995","RATNA INDAH SARI","P",null,16]
[17,"9985058152","LAIHATUL JANNAH","P",17]
[18,"9980452316","EKA ROSDIANA","P",null,18]
[19,"9975155987","NAILA NIHAYATI","P",19]
[20,"9985058206","ALMA YUNITA","P",null,20]
[21,"9970453414","EVA OKTOVIANI","P",21]
[22,"9970453415","EVI OKTOVIANI","P",null,22]
[23,"9980452171","KIKI ROSMIYATI","P",23]
[24,"9980439854","ULFAH","p",null,24]
[25,"9985113816","MUHAMMAD RICHO ANDRYANSYAH","L",25]
[26,"9985058159","FITRI FITRIA","P",null,26]
[27,"9985057588","JUNENGSIH","P",27]
[28,"9980452149","INA AYATILLAH","P",null,28]
[29,"9980439794","DARSIH","P",29]
[30,"9980451595","ZA'FAR SHODIK","L",null,30]
[31,9970455136,"HUNAFA UNISA","P",31]
[32,9970439985,"DEWI RISTAULINA","P",null,32]
[33,9985115302,"RAHMA DWI ANDINI","P",33]
[34,9980450743,"CITRA KUSUMA ASHARI","P",null,34]
[35,9980439911,"VIVI APRILIANI","P",35]
[36,9980451583,"ROHAYANAH","P",null,36]
[37,9982165505,"NIKI SANJAYA","P",37]
[]
[null,null,"Jumlah Laki-laki",6,null,"Cilegon,…………………………….20"]
[null,null,"Jumlah Perempuan",31,null,"Guru Bidang Studi"]
[null,null,"Jumlah Total",37]
[]
[]
[]
[]
[null,null,null,null,null,"(……………………...……….)"]
[null,null,null,null,null,"NIP:……………………………………."]
[]
[]
[]
[]
[]
[]
[]
[]
[]
[]
[]
["DAFTAR HADIR SISWA/I PESERTA MOS"]
["SMA NEGERI 5 CILEGON"]
["TAHUN AJARAN 2013-2014"]
["RUANGAN",null,"X-4"]
["NO","NIS","NAMA","L/P","PARAF"]
[]
[]
[1,9970454323,"NIRA SETIYAWATI","P",1]
[2,9980450541,"KHOIRUNISA","P",null,2]
[3,9980451906,"VINDA ELISA DEWI","P",3]
[4,9975156700,"AMRULLAH","L",null,4]
[5,99756079,"HANI SANTIKA YULIA C","P",5]
[6,9980452342,"RIHARTI FEBRU. A","P",null,6]
[7,9985114347,"MAIYAH","P",7]
[8,9970455939,"FAHMI ROBIYANTO","L",null,8]
[9,9975213655,"ISMATULLAH","L",9]
[10,9985058655,"PINKEN BAYU OCSEA","P",null,10]
[11,0,"ANGGI NURMALA SARI","P",11]
[12,"9980453476","NURUL RAHMAH","P",null,12]
[13,"9980453048","HANI DWI AGUSTIN","P",13]
[14,"9980450386","KRIS MONIKA DIAN SAPUTRA","P",null,14]
[15,"9980451575","RANI PUSPA YULIANI","P",15]
[16,"9980439644","AFRIN NURASIAH","P",null,16]
[17,0,"HUZATUL ISLAMIAH","P",17]
[18,"9970455180","NENI EFIYANAH","P",null,18]
[19,"9990411546","AGHNIYA MAKARIMARRIZQI SIROD","P",19]
[20,"9980450221","ADE ISWANDI","L",null,20]
[21,"9980451850","DIAH RIZKI PUTRIYUNI","P",21]
[22,"9980451910","WINDI AZHARI","P",null,22]
[23,"9985058227","MUNIATUL HASANAH","P",23]
[24,"9980452144","EKA RIYANI","P",null,24]
[25,"9980451611","FENTI AYUNINGSIH","P",25]
[26,"9982547227","USMAN LESMANA","L",null,26]
[27,"9985058269","IIM AMELIA","P",27]
[28,"9975156687","MA'FIROH","P",null,28]
[29,9986372319,"SUKMAPANJI WULUNG","L",29]
[30,"9980451043","SITI ISTIQOMAH","P",null,30]
[31,"9985114341","MUHAMAD UMAR","L",31]
[32,"9980450419","YOLLA FEBRI ARUM SARI","P",null,32]
[33,"9980451834","ANGGUN NOVITASARI","P",33]
[34,"9980453699","ICHA ULLY MARYARTHA","P",null,34]
[35,"9980439903","EEN NAJIYAH","P",35]
[36,"9980450416","TRI SETIO ASTUTI","P",null,36]
[37,"9980450332","PUTRI RAMADHANI","L",37]
[]
[null,null,"Jumlah Laki-laki",8]
[null,null,"Jumlah Perempuan",29]
[null,null,"Jumlah Total",37]
[]
[]
[]
[]
[]
[]
[]
[]
[]
[]
[]
[]
[]
[]
[]
[]
[]
["DAFTAR HADIR SISWA/I PESERTA MOS"]
["SMA NEGERI 5 CILEGON"]
["TAHUN AJARAN 2013-2014"]
["RUANGAN",null,"X-5"]
["NO","NIS","NAMA","L/P","PARAF"]
[]
[]
[1,0,"IDA FARIDA","P",1]
[2,9970453424,"ILHAM NURULLAH","L",null,2]
[3,9985059068,"DHENTIE PRAHASTYA WARDANIE","P",3]
[4,9980450405,"RIZKI MAULIYANDI","L",null,4]
[5,9975214091,"YULIA AFRIANTI","P",5]
[6,9985058174,"SITI HABIBAH","P",null,6]
[7,998045173,"RESI RAYU TAMA","P",7]
[8,9980451797,"ALDIN DESTRIAN","L",null,8]
[9,9980451004,"MAYANG DEVI YAUMIL FATIH","P",9]
[10,"9980455011","LENI MUNYATI","P",null,10]
[11,"9980452179","MUHAMMAD REVANDI","L",11]
[12,"9985058275","ABDUS SALAM","L",null,12]
[13,"9972983692","YULIA EKA PUTRI","P",13]
[14,"9990413213","LINDA WATI","P",null,14]
[15,"9980453271","SITI KURNIA","P",15]
[16,"9986076305","NOVITA","P",null,16]
[17,"9970456125","SAPTIYAH NENGSIH","P",17]
[18,"9960471840","ARI SAHRUL","L",null,18]
[19,"9970456117","ROHIMAH","p",19]
[20,"9980452958","WAHYU SADDAM","L",null,20]
[21,"9980453083","IMTIAZUL FIQROH","P",21]
[22,"9980453703","KHAYATUN NUFUS","P",null,22]
[23,"9980439838","KHAIRUNNISA","P",23]
[24,9986077676,"ARIS MUNANDAR","L",null,24]
[25,9986077604,"MUHAMAD RICKI SAPUTRA","L",25]
[26,9976115638,"ADAM IKHSAN","L",null,26]
[27,9980439797,"EVIYANA","P",27]
[28,9970453437,"MITA APRILIANTI","P",null,28]
[29,9980452107,"HANI LESTARI","P",29]
[30,9980452260,"ATIKA NOVRIANTI","P",null,30]
[31,9981147324,"MEGA NUR RACHMAH","P",31]
[32,9970454639,"INGGRIT GARNESAH SUHARYANI","P",null,32]
[33,9975156006,"SITI LUTFIAH","P",33]
[34,"9980450420","YUSNIATI","P",null,34]
[35,"9988379813","SALLI FELIANI","P",35]
[36,"9975156292","ISKANDAR CAHYADI","L",null,36]
[37,"9970456064","AYU AGUSTIN","P",37]
[38,"9980451684","ASTRI WIDIYANTI","P"]
[]
[null,null,"Jumlah Laki-laki",11,null,"Cilegon,…………………………….20"]
[null,null,"Jumlah Perempuan",27,null,"Guru Bidang Studi"]
[null,null,"Jumlah Total",38]
[]
[]
[]
[null,null,null,null,null,"(……………………...……….)"]
[null,null,null,null,null,"NIP:……………………………………."]
[]
[]
[]
[]
[]
[]
[]
[]
[]
[]
[]
["DAFTAR HADIR SISWA/I PESERTA MOS"]
["SMA NEGERI 5 CILEGON"]
["TAHUN AJARAN 2013-2014"]
["RUANGAN",null,"X-6"]
["NO","NIS","NAMA","L/P","PARAF"]
[]
[]
[1,"9980450388","LATIVA FEBRIANI","P",1]
[2,"9990399728","SITI HANIFAH","P",null,2]
[3,"9985058280","ALDI GUNAWAN","L",3]
[4,"9980021130","ELITA PUTRI","P",null,4]
[5,"9980453096","BAIDOWI","L",5]
[6,"9980450859","SEFIYANTI","P",null,6]
[7,"9980451861","FITRIYANTI","P",7]
[8,"9980452104","FIFI FIRDIYANI","P",null,8]
[9,"9980453251","KURNIA DININGRUM","P",9]
[10,"9980451835","ANGRUM HUSNALILLAH","P",null,10]
[11,"9975156617","MITA AMALIA","P",11]
[12,"99804541907","WAHYU ISMATULLAH","L",null,12]
[13,"9950477880","WULAN SARI","P",13]
[14,"998045359","AHMAD SEHADI","L",null,14]
[15,"9960472678","KIKI KARTIKA SARI","P",15]
[16,"9975213671","PUTRI LESTARI","P",null,16]
[17,"9970454021","RIA OKTAVIANI","P",17]
[18,"9980452281","KAMANIA DWI WULANDARI","P",null,18]
[19,9980450223,"AHMAD RENALDI","L",19]
[20,0,"RISALAHWATI ROMDHON","P",null,20]
[21,"9988057595","YUNI SAVIRA","P",21]
[22,"9980452259","ABDUL GOFUR","L",null,22]
[23,"9988379807","SHELA ADISTYA","P",23]
[24,"9970454346","SITI NURYENI","P",null,24]
[25,"9990410892","SUHENDRA","L",25]
[26,"9980450707","ROSITA AINUN","P",null,26]
[27,"9970456105","SITI ASIAH","P",27]
[28,"9960472674","DARUSMAN","L",null,28]
[29,0,"RESSIANA ELPA MARLINA PRAMUDJI","P",29]
[30,"9880450157","GURUH JEFSETYANTO MEISANIA","L",null,30]
[31,"9966234184","HERMAWAN","L",31]
[32,0,"NURMAN SYAH","L",null,32]
[33,"9970452597","LENI DWI AMBARWATI","P",33]
[34,"9975155979","YOYON MAYONI","P",null,34]
[35,"9971842508","DIAN APRIYADI","L",35]
[null,"9970456459","VERBENA INELITA","P",null,36]
[null,"9970454840","ISTIQOMAH","P",37]
[null,0,"AZAZ MUZAYYINI","L"]
[]
[null,null,"Jumlah Laki-laki",13,null,"Cilegon,…………………………….20"]
[null,null,"Jumlah Perempuan",25,null,"Guru Bidang Studi"]
[null,null,"Jumlah Total",38]
[]
[]
[]
[null,null,null,null,null,"(……………………...……….)"]
[null,null,null,null,null,"NIP:……………………………………."]